{"text_format":"1","workbook":"xlsx","n_sheets":15,"sheets":["Instructions","Contest Entry","Log Entry","Start Times","Overall Results","Class Results","Novice Results","Boats & Observers","Club Participation","Team Trophy","Leg Scores","Cross-Check Log","Class Certificates","Yacht Clubs","Contestants"],"not_rendered":{"charts":0,"images":28,"macros":1,"external_links":0,"defined_names":119,"comments":0,"pivot_tables":0},"unopened":[],"bounds":{"document_bytes":16777216,"sheet_cells":100000,"rows_first":2000,"rows_last":500,"rows_between":2000,"halvings":0,"cell_chars":16384,"cell_head_chars":4096},"cells_cut":0,"cells_raw":0,"read":"whole","date_system":"1900"}

{"sheet":"Instructions","index":0,"n_rows":44,"n_cols":3,"rows_kept":44,"cut":false,"hidden":false,"merged":[]}
[null,"SYC Predicted Log Race Scoring Spreadsheet"]
[null,"© 2012-2013 Steve Hazlerig"]
[null,"Email: steve@hazlerig.com"]
[]
[null,"This spreadsheet is used by yacht clubs to score Predicted Log Race (Cruiser Navigation) contests."]
[]
[null,"Instructions"]
[]
[null,"1) In general, enter data only in the cells and sheets that are highlighted in Yellow.  All of the Green sheets are calculated from data entered in the Yellow sheets."]
[null,"2) Start by entering contest-specific information into the \"Contest Entry\" sheet."]
{"$rows_left_out":35}
{"sheet":"Contest Entry","index":1,"n_rows":32,"n_cols":9,"rows_kept":32,"cut":false,"hidden":false,"merged":[[25,8,25,9],[26,8,26,9],[11,1,11,4],[10,1,10,4],[0,1,0,4],[1,1,1,4],[2,1,2,4],[3,1,3,4],[5,1,5,4],[9,1,9,4],[8,1,8,4],[4,1,4,4],[6,1,6,4],[7,1,7,4]]}
["Club Name:","SYC"]
["Contest Name:","Stimson"]
["Contest Date:","2018-09-15"]
["Official Mileage:",14]
["Contestants Expected:",9,null,null,null,"(1-48)"]
["Contestants Entered:",{"$f":"COUNTA(IPBA_Numbers)","v":9}]
["Predicted Logs Entered:",{"$f":"COUNT(Predicted_Start_Times)","v":9}]
["Contest Logs Entered:",{"$f":"COUNT(Actual_Start_Times)","v":9}]
["Number of Novices:",{"$f":"COUNT(Novice_Rank)","v":1},{"$f":"COUNT('Log Entry'!79:79)+ROW()","v":15},{"$f":"COUNT('Log Entry'!79:79)+ROW()","v":15},{"$f":"COUNT('Log Entry'!79:79)+ROW()","v":15}]
["Number of Control Points:",4,null,null,null,"(1 - 8)"]
{"$rows_left_out":23}
{"sheet":"Log Entry","index":2,"n_rows":87,"n_cols":62,"rows_kept":87,"cut":false,"hidden":false,"merged":[[31,0,31,1],[58,0,58,1],[85,0,85,1],[86,0,86,1],[0,0,0,1],[5,0,5,1],[6,0,6,1],[80,0,80,1],[75,0,75,1],[76,0,76,1],[77,0,77,1],[78,0,78,1],[79,0,79,1],[1,0,1,1],[2,0,2,1],[7,0,7,1],[3,0,3,1],[4,0,4,1],[10,0,10,1],[20,0,20,1],[21,0,21,1],[8,0,8,1],[11,0,11,1],[71,0,71,1],[83,0,83,1],[84,0,84,1],[9,0,9,1],[74,0,74,1],[59,0,59,1],[69,0,69,1],[32,0,32,1],[73,0,73,1],[30,0,30,1],[33,0,33,1],[68,0,68,1],[70,0,70,1],[72,0,72,1],[82,0,82,1],[81,0,81,1]]}
["IPBA Number",null,165,null,689,7,694,677,120,663,533,1100]
["Contestant Name",null,"Brent Reys",null,"Clint Chapin","Jim Korzetz","Jim VanAntwerp","Ken Case","Mike Henry","Larry O'Keefe","Team Klett/Elbon/Cullen","Dan DeGard",null,null,null,null,null,null,null,null,null,null,null,null,null,null,null,null,null,null,null,null,null,null,null,null,null,null,null,null,null,null,null,null,null,null,null,null,null,null,{"$f":"IFERROR(VLOOKUP(AY$1,Contestants!$A:$H,ROW(),FALSE),\"\")","v":""},{"$f":"IFERROR(VLOOKUP(AZ$1,Contestants!$A:$H,ROW(),FALSE),\"\")","v":""},{"$f":"IFERROR(VLOOKUP(BA$1,Contestants!$A:$H,ROW(),FALSE),\"\")","v":""},{"$f":"IFERROR(VLOOKUP(BB$1,Contestants!$A:$H,ROW(),FALSE),\"\")","v":""},{"$f":"IFERROR(VLOOKUP(BC$1,Contestants!$A:$H,ROW(),FALSE),\"\")","v":""},{"$f":"IFERROR(VLOOKUP(BD$1,Contestants!$A:$H,ROW(),FALSE),\"\")","v":""},{"$f":"IFERROR(VLOOKUP(BE$1,Contestants!$A:$H,ROW(),FALSE),\"\")","v":""},{"$f":"IFERROR(VLOOKUP(BF$1,Contestants!$A:$H,ROW(),FALSE),\"\")","v":""},{"$f":"IFERROR(VLOOKUP(BG$1,Contestants!$A:$H,ROW(),FALSE),\"\")","v":""},{"$f":"IFERROR(VLOOKUP(BH$1,Contestants!$A:$H,ROW(),FALSE),\"\")","v":""},{"$f":"IFERROR(VLOOKUP(BI$1,Contestants!$A:$H,ROW(),FALSE),\"\")","v":""},{"$f":"IFERROR(VLOOKUP(BJ$1,Contestants!$A:$H,ROW(),FALSE),\"\")","v":""}]
["Navigator Name(s)",null,"Alex Lorenz",null,"Lynn Hvalsoe","Dick Timmerman","OJ Potter","Debbie Case","Billie Henry","Ted Burns","Elbon/Klett","JJ Johnson",null,null,null,null,null,null,null,null,null,null,null,null,null,null,null,null,null,null,null,null,null,null,null,null,null,null,null,null,null,null,null,null,null,null,null,null,null,null,{"$f":"IFERROR(VLOOKUP(AY$1,Contestants!$A:$H,ROW(),FALSE),\"\")","v":""},{"$f":"IFERROR(VLOOKUP(AZ$1,Contestants!$A:$H,ROW(),FALSE),\"\")","v":""},{"$f":"IFERROR(VLOOKUP(BA$1,Contestants!$A:$H,ROW(),FALSE),\"\")","v":""},{"$f":"IFERROR(VLOOKUP(BB$1,Contestants!$A:$H,ROW(),FALSE),\"\")","v":""},{"$f":"IFERROR(VLOOKUP(BC$1,Contestants!$A:$H,ROW(),FALSE),\"\")","v":""},{"$f":"IFERROR(VLOOKUP(BD$1,Contestants!$A:$H,ROW(),FALSE),\"\")","v":""},{"$f":"IFERROR(VLOOKUP(BE$1,Contestants!$A:$H,ROW(),FALSE),\"\")","v":""},{"$f":"IFERROR(VLOOKUP(BF$1,Contestants!$A:$H,ROW(),FALSE),\"\")","v":""},{"$f":"IFERROR(VLOOKUP(BG$1,Contestants!$A:$H,ROW(),FALSE),\"\")","v":""},{"$f":"IFERROR(VLOOKUP(BH$1,Contestants!$A:$H,ROW(),FALSE),\"\")","v":""},{"$f":"IFERROR(VLOOKUP(BI$1,Contestants!$A:$H,ROW(),FALSE),\"\")","v":""},{"$f":"IFERROR(VLOOKUP(BJ$1,Contestants!$A:$H,ROW(),FALSE),\"\")","v":""}]
["Boat Name",null,"PANACHE",null,"SOJOURN","FREEDOM","SARAH B","RAZZLE","PEACHY KEEN","MISS MIRANDA","KLETTITAT","SAGA",null,null,null,null,null,null,null,null,null,null,null,null,null,null,null,null,null,null,null,null,null,null,null,null,null,null,null,null,null,null,null,null,null,null,null,null,null,null,{"$f":"IFERROR(UPPER(VLOOKUP(AY$1,Contestants!$A:$H,ROW(),FALSE)),\"\")","v":""},{"$f":"IFERROR(UPPER(VLOOKUP(AZ$1,Contestants!$A:$H,ROW(),FALSE)),\"\")","v":""},{"$f":"IFERROR(UPPER(VLOOKUP(BA$1,Contestants!$A:$H,ROW(),FALSE)),\"\")","v":""},{"$f":"IFERROR(UPPER(VLOOKUP(BB$1,Contestants!$A:$H,ROW(),FALSE)),\"\")","v":""},{"$f":"IFERROR(UPPER(VLOOKUP(BC$1,Contestants!$A:$H,ROW(),FALSE)),\"\")","v":""},{"$f":"IFERROR(UPPER(VLOOKUP(BD$1,Contestants!$A:$H,ROW(),FALSE)),\"\")","v":""},{"$f":"IFERROR(UPPER(VLOOKUP(BE$1,Contestants!$A:$H,ROW(),FALSE)),\"\")","v":""},{"$f":"IFERROR(UPPER(VLOOKUP(BF$1,Contestants!$A:$H,ROW(),FALSE)),\"\")","v":""},{"$f":"IFERROR(UPPER(VLOOKUP(BG$1,Contestants!$A:$H,ROW(),FALSE)),\"\")","v":""},{"$f":"IFERROR(UPPER(VLOOKUP(BH$1,Contestants!$A:$H,ROW(),FALSE)),\"\")","v":""},{"$f":"IFERROR(UPPER(VLOOKUP(BI$1,Contestants!$A:$H,ROW(),FALSE)),\"\")","v":""},{"$f":"IFERROR(UPPER(VLOOKUP(BJ$1,Contestants!$A:$H,ROW(),FALSE)),\"\")","v":""}]
["Yacht Club",null,"SYC",null,"MBYC","PYC","BYC","SYC","BYC","SYC","QCYC","BYC",null,null,null,null,null,null,null,null,null,null,null,null,null,null,null,null,null,null,null,null,null,null,null,null,null,null,null,null,null,null,null,null,null,null,null,null,null,null,{"$f":"IFERROR(VLOOKUP(AY$1,Contestants!$A:$H,ROW(),FALSE),\"\")","v":""},{"$f":"IFERROR(VLOOKUP(AZ$1,Contestants!$A:$H,ROW(),FALSE),\"\")","v":""},{"$f":"IFERROR(VLOOKUP(BA$1,Contestants!$A:$H,ROW(),FALSE),\"\")","v":""},{"$f":"IFERROR(VLOOKUP(BB$1,Contestants!$A:$H,ROW(),FALSE),\"\")","v":""},{"$f":"IFERROR(VLOOKUP(BC$1,Contestants!$A:$H,ROW(),FALSE),\"\")","v":""},{"$f":"IFERROR(VLOOKUP(BD$1,Contestants!$A:$H,ROW(),FALSE),\"\")","v":""},{"$f":"IFERROR(VLOOKUP(BE$1,Contestants!$A:$H,ROW(),FALSE),\"\")","v":""},{"$f":"IFERROR(VLOOKUP(BF$1,Contestants!$A:$H,ROW(),FALSE),\"\")","v":""},{"$f":"IFERROR(VLOOKUP(BG$1,Contestants!$A:$H,ROW(),FALSE),\"\")","v":""},{"$f":"IFERROR(VLOOKUP(BH$1,Contestants!$A:$H,ROW(),FALSE),\"\")","v":""},{"$f":"IFERROR(VLOOKUP(BI$1,Contestants!$A:$H,ROW(),FALSE),\"\")","v":""},{"$f":"IFERROR(VLOOKUP(BJ$1,Contestants!$A:$H,ROW(),FALSE),\"\")","v":""}]
["Cruise Speed",null,9.4740000000000002,null,7.3,8.39,7,9.89,8.1750000000000007,8.5920000000000005,9.61,8,null,null,null,null,null,null,null,null,null,null,null,null,null,null,null,null,null,null,null,null,null,null,null,null,null,null,null,null,null,null,null,null,null,null,null,null,null,null,{"$f":"IFERROR(VLOOKUP(AY$1,Contestants!$A:$H,ROW(),FALSE),\"\")","v":""},{"$f":"IFERROR(VLOOKUP(AZ$1,Contestants!$A:$H,ROW(),FALSE),\"\")","v":""},{"$f":"IFERROR(VLOOKUP(BA$1,Contestants!$A:$H,ROW(),FALSE),\"\")","v":""},{"$f":"IFERROR(VLOOKUP(BB$1,Contestants!$A:$H,ROW(),FALSE),\"\")","v":""},{"$f":"IFERROR(VLOOKUP(BC$1,Contestants!$A:$H,ROW(),FALSE),\"\")","v":""},{"$f":"IFERROR(VLOOKUP(BD$1,Contestants!$A:$H,ROW(),FALSE),\"\")","v":""},{"$f":"IFERROR(VLOOKUP(BE$1,Contestants!$A:$H,ROW(),FALSE),\"\")","v":""},{"$f":"IFERROR(VLOOKUP(BF$1,Contestants!$A:$H,ROW(),FALSE),\"\")","v":""},{"$f":"IFERROR(VLOOKUP(BG$1,Contestants!$A:$H,ROW(),FALSE),\"\")","v":""},{"$f":"IFERROR(VLOOKUP(BH$1,Contestants!$A:$H,ROW(),FALSE),\"\")","v":""},{"$f":"IFERROR(VLOOKUP(BI$1,Contestants!$A:$H,ROW(),FALSE),\"\")","v":""},{"$f":"IFERROR(VLOOKUP(BJ$1,Contestants!$A:$H,ROW(),FALSE),\"\")","v":""}]
["Slow Speed",null,6.923,7,7,7,null,7,7,null,null,null,null,null,null,null,null,null,null,null,null,null,null,null,null,null,null,null,null,null,null,null,null,null,null,null,null,null,null,null,null,null,null,null,null,null,null,null,null,null,{"$f":"IFERROR(VLOOKUP(AY$1,Contestants!$A:$H,ROW(),FALSE),\"\")","v":""},{"$f":"IFERROR(VLOOKUP(AZ$1,Contestants!$A:$H,ROW(),FALSE),\"\")","v":""},{"$f":"IFERROR(VLOOKUP(BA$1,Contestants!$A:$H,ROW(),FALSE),\"\")","v":""},{"$f":"IFERROR(VLOOKUP(BB$1,Contestants!$A:$H,ROW(),FALSE),\"\")","v":""},{"$f":"IFERROR(VLOOKUP(BC$1,Contestants!$A:$H,ROW(),FALSE),\"\")","v":""},{"$f":"IFERROR(VLOOKUP(BD$1,Contestants!$A:$H,ROW(),FALSE),\"\")","v":""},{"$f":"IFERROR(VLOOKUP(BE$1,Contestants!$A:$H,ROW(),FALSE),\"\")","v":""},{"$f":"IFERROR(VLOOKUP(BF$1,Contestants!$A:$H,ROW(),FALSE),\"\")","v":""},{"$f":"IFERROR(VLOOKUP(BG$1,Contestants!$A:$H,ROW(),FALSE),\"\")","v":""},{"$f":"IFERROR(VLOOKUP(BH$1,Contestants!$A:$H,ROW(),FALSE),\"\")","v":""},{"$f":"IFERROR(VLOOKUP(BI$1,Contestants!$A:$H,ROW(),FALSE),\"\")","v":""},{"$f":"IFERROR(VLOOKUP(BJ$1,Contestants!$A:$H,ROW(),FALSE),\"\")","v":""}]
["Finish Class",null,4,null,1,2,1,5,2,3,5,1,null,null,null,null,null,null,null,null,null,null,null,null,null,null,null,null,null,null,null,null,null,null,null,null,null,null,null,null,null,null,null,null,null,null,null,null,null,null,{"$f":"IFERROR(VLOOKUP(AY$1,Contestants!$A:$H,ROW(),FALSE),\"\")","v":""},{"$f":"IFERROR(VLOOKUP(AZ$1,Contestants!$A:$H,ROW(),FALSE),\"\")","v":""},{"$f":"IFERROR(VLOOKUP(BA$1,Contestants!$A:$H,ROW(),FALSE),\"\")","v":""},{"$f":"IFERROR(VLOOKUP(BB$1,Contestants!$A:$H,ROW(),FALSE),\"\")","v":""},{"$f":"IFERROR(VLOOKUP(BC$1,Contestants!$A:$H,ROW(),FALSE),\"\")","v":""},{"$f":"IFERROR(VLOOKUP(BD$1,Contestants!$A:$H,ROW(),FALSE),\"\")","v":""},{"$f":"IFERROR(VLOOKUP(BE$1,Contestants!$A:$H,ROW(),FALSE),\"\")","v":""},{"$f":"IFERROR(VLOOKUP(BF$1,Contestants!$A:$H,ROW(),FALSE),\"\")","v":""},{"$f":"IFERROR(VLOOKUP(BG$1,Contestants!$A:$H,ROW(),FALSE),\"\")","v":""},{"$f":"IFERROR(VLOOKUP(BH$1,Contestants!$A:$H,ROW(),FALSE),\"\")","v":""},{"$f":"IFERROR(VLOOKUP(BI$1,Contestants!$A:$H,ROW(),FALSE),\"\")","v":""},{"$f":"IFERROR(VLOOKUP(BJ$1,Contestants!$A:$H,ROW(),FALSE),\"\")","v":""}]
["Observer"]
["Racing Less Than 3 Years"]
{"$rows_left_out":78}
{"sheet":"Start Times","index":3,"n_rows":56,"n_cols":6,"rows_kept":56,"cut":false,"hidden":false,"merged":[[0,0,0,5],[1,0,1,5],[2,0,2,5]]}
[{"$f":"'Contest Entry'!B1","v":"SYC"}]
[{"$f":"'Contest Entry'!B2","v":"Stimson"}]
[{"$f":"'Contest Entry'!B3","v":"2018-09-15"}]
[]
["START and FINISH TIMES"]
[]
["Boat","Contestant","Yacht Club","Boat Speed","Start Time","Finish Time"]
[]
[{"$f":"IF(ROW()-8<=Number_of_Contestants,UPPER(INDEX(Boat_Names,,MATCH(ROW()-8,Start_Time_Rank,0))),\"\")","v":"SOJOURN"},{"$f":"IF(ROW()-8<=Number_of_Contestants,INDEX(Contestant_Names,,MATCH(ROW()-8,Start_Time_Rank,0)),\"\")","v":"Clint Chapin"},{"$f":"IF(ROW()-8<=Number_of_Contestants,INDEX(Club_Names,,MATCH(ROW()-8,Start_Time_Rank,0)),\"\")","v":"MBYC"},{"$f":"IF(ROW()-8<=Number_of_Contestants,INDEX(Cruise_Speeds,,MATCH(ROW()-8,Start_Time_Rank,0)),\"\")","v":7.3},{"$f":"IF(ROW()-8<=Number_of_Contestants,INDEX(Predicted_Start_Times,,MATCH(ROW()-8,Start_Time_Rank,0)),\"\")","v":123238},{"$f":"IF(ROW()-8<=Number_of_Contestants,INDEX(Finish_Times,,MATCH(ROW()-8,Start_Time_Rank,0)),\"\")","v":143000}]
["SARAH B","Jim VanAntwerp","BYC",7,124516,145000]
{"$rows_left_out":47}
{"sheet":"Overall Results","index":4,"n_rows":56,"n_cols":7,"rows_kept":56,"cut":false,"hidden":false,"merged":[[0,0,0,6],[1,0,1,6],[2,0,2,6]]}
[{"$f":"'Contest Entry'!B1","v":"SYC"}]
[{"$f":"'Contest Entry'!B2","v":"Stimson"}]
[{"$f":"'Contest Entry'!B3","v":"2018-09-15"}]
[]
["OVERALL RESULTS"]
[]
["Boat","Contestant","Navigator","Yacht Club","% Error","Place OA","NACA Pts"]
[]
[{"$f":"IF(F9<=Number_of_Contestants,UPPER(INDEX(Boat_Names,,MATCH(F9,Overall_Rank,0))),\"\")","v":"FREEDOM"},{"$f":"IF(F9<=Number_of_Contestants,INDEX(Contestant_Names,,MATCH(F9,Overall_Rank,0)),\"\")","v":"Jim Korzetz"},{"$f":"IF(F9<=Number_of_Contestants,INDEX(Navigator_Names,,MATCH(F9,Overall_Rank,0)),\"\")","v":"Dick Timmerman"},{"$f":"IF(F9<=Number_of_Contestants,INDEX(Club_Names,,MATCH(F9,Overall_Rank,0)),\"\")","v":"PYC"},{"$f":"IF(F9<=Number_of_Contestants,INDEX(Net_Error,,MATCH(F9,Overall_Rank,0)),\"\")","v":1.6159994474931739E-3},{"$f":"IF(ROW()-8<=Number_of_Contestants,ROW()-8,\"\")","v":1},{"$f":"IF(F9=\"\",\"\",1000-(((700*(F9-0.79))/(Number_of_Contestants-0.79))))","v":982.09500609013401}]
["SARAH B","Jim VanAntwerp","OJ Potter","BYC",3.1752538749331913E-3,2,{"$f":"IF(F10=\"\",\"\",1000-(((700*(F10-0.79))/(Number_of_Contestants-0.79))))","v":896.83313032886724}]
{"$rows_left_out":47}
{"sheet":"Class Results","index":5,"n_rows":62,"n_cols":7,"rows_kept":62,"cut":false,"hidden":false,"merged":[[42,0,42,5],[52,0,52,5],[0,0,0,5],[1,0,1,5],[2,0,2,5],[12,0,12,5],[22,0,22,5],[32,0,32,5]]}
[{"$f":"'Contest Entry'!B1","v":"SYC"}]
[{"$f":"'Contest Entry'!B2","v":"Stimson"}]
[{"$f":"'Contest Entry'!B3","v":"2018-09-15"}]
[]
["CLASS RESULTS"]
[]
["Boat","Contestant","Navigator","Yacht Club","Percent Error","Place OA","Class Selector"]
[]
[{"$f":"IF(F9<=Number_of_Contestants,UPPER(INDEX(Boat_Names,,MATCH(F9,Overall_Rank,0))),\"\")","v":"FREEDOM"},{"$f":"IF(F9<=Number_of_Contestants,INDEX(Contestant_Names,,MATCH(F9,Overall_Rank,0)),\"\")","v":"Jim Korzetz"},{"$f":"IF(F9<=Number_of_Contestants,INDEX(Navigator_Names,,MATCH(F9,Overall_Rank,0)),\"\")","v":"Dick Timmerman"},{"$f":"IF(F9<=Number_of_Contestants,INDEX(Club_Names,,MATCH(F9,Overall_Rank,0)),\"\")","v":"PYC"},{"$f":"IF(F9<=Number_of_Contestants,INDEX(Net_Error,,MATCH(F9,Overall_Rank,0)),\"\")","v":1.6159994474931739E-3},{"$f":"IF(ROW()-8<=Number_of_Contestants,ROW()-8,\"\")","v":1}]
[{"$f":"IF(F10<=Number_of_Contestants,UPPER(INDEX(Boat_Names,,MATCH(F10,Overall_Rank,0))),\"\")","v":"SARAH B"},{"$f":"IF(F10<=Number_of_Contestants,INDEX(Contestant_Names,,MATCH(F10,Overall_Rank,0)),\"\")","v":"Jim VanAntwerp"},{"$f":"IF(F10<=Number_of_Contestants,INDEX(Navigator_Names,,MATCH(F10,Overall_Rank,0)),\"\")","v":"OJ Potter"},{"$f":"IF(F10<=Number_of_Contestants,INDEX(Club_Names,,MATCH(F10,Overall_Rank,0)),\"\")","v":"BYC"},{"$f":"IF(F10<=Number_of_Contestants,INDEX(Net_Error,,MATCH(F10,Overall_Rank,0)),\"\")","v":3.1752538749331913E-3},{"$f":"IF(ROW()-8<=Number_of_Contestants,ROW()-8,\"\")","v":2}]
{"$rows_left_out":53}
{"sheet":"Novice Results","index":6,"n_rows":68,"n_cols":6,"rows_kept":68,"cut":false,"hidden":false,"merged":[[0,0,0,5],[1,0,1,5],[2,0,2,5]]}
[{"$f":"'Contest Entry'!B1","v":"SYC"}]
[{"$f":"'Contest Entry'!B2","v":"Stimson"}]
[{"$f":"'Contest Entry'!B3","v":"2018-09-15"}]
[]
["NOVICE RESULTS"]
[]
["Boat","Contestant","Navigator","Yacht Club","% Error","Novice"]
[]
[{"$f":"IF(F9<=Number_of_Novices,UPPER(INDEX(Boat_Names,,MATCH(F9,Novice_Rank,0))),\"\")","v":"SAGA"},{"$f":"IF(F9<=Number_of_Novices,INDEX(Contestant_Names,,MATCH(F9,Novice_Rank,0)),\"\")","v":"Dan DeGard"},{"$f":"IF(F9<=Number_of_Novices,INDEX(Navigator_Names,,MATCH(F9,Novice_Rank,0)),\"\")","v":"JJ Johnson"},{"$f":"IF(F9<=Number_of_Novices,INDEX(Club_Names,,MATCH(F9,Novice_Rank,0)),\"\")","v":"BYC"},{"$f":"IF(F9<=Number_of_Novices,INDEX(Net_Error,,MATCH(F9,Novice_Rank,0)),\"\")","v":1.157780450286458E-2},{"$f":"IF(ROW()-8<=Number_of_Novices,ROW()-8,\"\")","v":1}]
["","","","","",""]
{"$rows_left_out":59}
{"sheet":"Boats & Observers","index":7,"n_rows":56,"n_cols":5,"rows_kept":56,"cut":false,"hidden":false,"merged":[[0,0,0,4],[1,0,1,4],[2,0,2,4]]}
[{"$f":"'Contest Entry'!B1","v":"SYC"}]
[{"$f":"'Contest Entry'!B2","v":"Stimson"}]
[{"$f":"'Contest Entry'!B3","v":"2018-09-15"}]
[]
["BOAT and OBSERVER LIST"]
[]
["Boat","Contestant","Navigator","Club","Observer"]
[]
[{"$f":"IF(ROW()-8<=Number_of_Contestants,UPPER(INDEX(Boat_Names,,MATCH(ROW()-8,Alpha_Boat_Rank,0))),\"\")","v":"FREEDOM"},{"$f":"IF(ROW()-8<=Number_of_Contestants,INDEX(Contestant_Names,,MATCH(ROW()-8,Alpha_Boat_Rank,0)),\"\")","v":"Jim Korzetz"},{"$f":"IF(ROW()-8<=Number_of_Contestants,INDEX(Navigator_Names,,MATCH(ROW()-8,Alpha_Boat_Rank,0)),\"\")","v":"Dick Timmerman"},{"$f":"IF(ROW()-8<=Number_of_Contestants,INDEX(Club_Names,,MATCH(ROW()-8,Alpha_Boat_Rank,0)),\"\")","v":"PYC"},{"$f":"IF(ROW()-8<=Number_of_Contestants,INDEX(Observer_Names,,MATCH(ROW()-8,Alpha_Boat_Rank,0)),\"\")","v":0}]
["KLETTITAT","Team Klett/Elbon/Cullen","Elbon/Klett","QCYC",0]
{"$rows_left_out":47}
{"sheet":"Club Participation","index":8,"n_rows":70,"n_cols":7,"rows_kept":70,"cut":false,"hidden":false,"merged":[[0,3,0,5],[1,3,1,5],[2,3,2,5]]}
[null,null,null,{"$f":"'Contest Entry'!B1","v":"SYC"}]
[null,null,null,{"$f":"'Contest Entry'!B2","v":"Stimson"}]
[null,null,null,{"$f":"'Contest Entry'!B3","v":"2018-09-15"}]
[]
[null,null,"YACHT CLUB PARTICIPATION"]
[]
[null,null,"Yacht Club","Boat","Contestant","Navigator"]
[null,1]
[{"$f":"IF(AND(B8=1,C9<>\"\"),B9,\"\")","v":3},{"$f":"IF(C9=C10,B10+1,1)","v":3},{"$f":"IF(ROW()-8<=Number_of_Contestants,INDEX(Club_Names,,MATCH(ROW()-8,Club_Boat_Rank,0)),\"\")","v":"BYC"},{"$f":"IF(ROW()-8<=Number_of_Contestants,UPPER(INDEX(Boat_Names,,MATCH(ROW()-8,Club_Boat_Rank,0))),\"\")","v":"PEACHY KEEN"},{"$f":"IF(ROW()-8<=Number_of_Contestants,INDEX(Contestant_Names,,MATCH(ROW()-8,Club_Boat_Rank,0)),\"\")","v":"Mike Henry"},{"$f":"IF(ROW()-8<=Number_of_Contestants,INDEX(Navigator_Names,,MATCH(ROW()-8,Club_Boat_Rank,0)),\"\")","v":"Billie Henry"}]
[{"$f":"IF(AND(B9=1,C10<>\"\"),B10,\"\")","v":""},{"$f":"IF(C10=C11,B11+1,1)","v":2},"BYC","SAGA","Dan DeGard","JJ Johnson"]
{"$rows_left_out":61}
{"sheet":"Team Trophy","index":9,"n_rows":56,"n_cols":8,"rows_kept":56,"cut":false,"hidden":false,"merged":[[0,2,0,7],[1,2,1,7],[2,2,2,7]]}
[null,null,{"$f":"'Contest Entry'!B1","v":"SYC"}]
[null,null,{"$f":"'Contest Entry'!B2","v":"Stimson"}]
[null,null,{"$f":"'Contest Entry'!B3","v":"2018-09-15"}]
[]
[null,null,"TEAM TROPHY"]
[]
[null,null,"Boat","Contestant","Navigator","Yacht Club","Percent Error","Avg Error"]
[null,1]
[{"$f":"RANK(H9,$H$9:$H$70,1)-ROWS($A$9:$A$70)+COUNTIF($H$9:$H$70,\"<>0\")","v":1},{"$f":"IF(F9=F10,B10+1,1)","v":3},{"$f":"IF(ROW()-8<=Number_of_Contestants,UPPER(INDEX(Boat_Names,,MATCH(ROW()-8,Club_Error_Rank,0))),\"\")","v":"SARAH B"},{"$f":"IF(ROW()-8<=Number_of_Contestants,INDEX(Contestant_Names,,MATCH(ROW()-8,Club_Error_Rank,0)),\"\")","v":"Jim VanAntwerp"},{"$f":"IF(ROW()-8<=Number_of_Contestants,INDEX(Navigator_Names,,MATCH(ROW()-8,Club_Error_Rank,0)),\"\")","v":"OJ Potter"},{"$f":"IF(ROW()-8<=Number_of_Contestants,INDEX(Club_Names,,MATCH(ROW()-8,Club_Error_Rank,0)),\"\")","v":"BYC"},{"$f":"IF(ROW()-8<=Number_of_Contestants,INDEX(Net_Error,,MATCH(ROW()-8,Club_Error_Rank,0)),\"\")","v":3.1752538749331913E-3},{"$f":"IF(AND(ROW()-8<=Number_of_Contestants,B8=1,B9>=Team_Size),AVERAGE(OFFSET(G9,0,0,Team_Size,1)),0)","v":6.3157198428427487E-3}]
[-45,{"$f":"IF(F10=F11,B11+1,1)","v":2},"PEACHY KEEN","Mike Henry","Billie Henry","BYC",4.1941011507304771E-3,0]
{"$rows_left_out":47}
{"sheet":"Leg Scores","index":10,"n_rows":72,"n_cols":11,"rows_kept":72,"cut":false,"hidden":false,"merged":[[0,0,0,10],[1,0,1,10],[2,0,2,10]]}
[{"$f":"'Contest Entry'!B1","v":"SYC"}]
[{"$f":"'Contest Entry'!B2","v":"Stimson"}]
[{"$f":"'Contest Entry'!B3","v":"2018-09-15"}]
[]
["BEST LOW SCORE PER LEG"]
[]
["Boat","Club","Contestant","CP1","CP2","CP3","CP4","CP5","CP6","CP7","CP8"]
[null,null,"Worst:",{"$f":"MAX(D$11:D$69)","v":50},{"$f":"MAX(E$11:E$69)","v":122},43,36,0,{"$f":"MAX(I$11:I$69)","v":0},0,0]
[null,null,"Average:",{"$f":"AVERAGE(D$11:D$69)","v":23},{"$f":"AVERAGE(E$11:E$69)","v":33.777777777777779},19.444444444444443,11.333333333333334,{"$error":"#DIV/0!"},{"$f":"AVERAGE(I$11:I$69)","v":{"$error":"#DIV/0!"}},{"$error":"#DIV/0!"},{"$error":"#DIV/0!"}]
[{"$f":"ROW()","v":10},null,"Best:",{"$f":"MIN(D$11:D$69)","v":0},1,5,2,0,0,0,0]
{"$rows_left_out":63}
{"sheet":"Cross-Check Log","index":11,"n_rows":42,"n_cols":30,"rows_kept":42,"cut":false,"hidden":false,"merged":[[41,1,41,4],[41,5,41,26],[68,2,68,20],[68,21,68,26],[26,2,26,4],[36,1,36,19],[36,20,36,26],[37,1,37,19],[37,20,37,26],[39,1,39,19],[39,20,39,26],[32,1,32,26],[33,1,33,26],[34,1,34,19],[34,20,34,26],[35,1,35,19],[35,20,35,26],[29,1,29,19],[29,20,29,26],[30,1,30,19],[30,20,30,26],[31,1,31,19],[31,20,31,26],[28,1,28,26],[40,1,40,26],[24,2,24,4],[24,5,25,5],[24,6,24,14],[24,15,24,18],[24,19,25,19],[26,6,26,18],[26,20,26,22],[26,24,26,26],[27,1,27,26],[38,1,38,19],[38,20,38,26],[23,2,23,4],[23,6,23,11],[23,13,23,18],[23,20,23,23],[23,24,23,25],[24,20,24,23],[24,24,24,25],[25,2,25,4],[25,6,25,14],[25,15,25,18],[25,20,25,22],[25,24,25,26],[21,2,21,4],[21,6,21,11],[21,13,21,18],[21,20,21,23],[21,24,21,25],[22,2,22,4],[22,6,22,11],[22,13,22,18],[22,20,22,23],[22,24,22,25],[19,2,19,4],[19,6,19,11],[19,13,19,18],[19,20,19,23],[19,24,19,25],[20,2,20,4],[20,6,20,11],[20,13,20,18],[20,20,20,23],[20,24,20,25],[17,2,17,4],[17,6,17,11],[17,13,17,18],[17,20,17,23],[17,24,17,25],[18,2,18,4],[18,6,18,11],[18,13,18,18],[18,20,18,23],[18,24,18,25],[15,2,15,4],[15,6,15,11],[15,13,15,18],[15,20,15,23],[15,24,15,25],[16,2,16,4],[16,6,16,11],[16,13,16,18],[16,20,16,23],[16,24,16,25],[2,1,2,26],[3,1,4,26],[5,1,5,26],[6,1,6,2],[6,3,6,12],[6,13,6,16],[6,17,6,26],[7,1,7,2],[7,3,7,12],[7,13,7,16],[7,17,7,26],[8,1,8,26],[9,1,9,4],[9,6,9,11],[9,13,9,18],[9,20,9,26],[10,1,10,4],[10,6,10,11],[10,13,13,18],[10,20,10,23],[10,24,14,26],[11,1,11,4],[11,6,11,11],[11,20,11,23],[12,1,12,4],[12,6,12,11],[12,21,12,23],[13,1,13,4],[13,6,13,11],[13,21,13,23],[14,1,15,1],[14,2,14,4],[14,6,14,11],[14,13,14,18],[14,20,14,23]]}
[170]
[{"$f":"MATCH(A1,'Log Entry'!C1:BJ1,0)","v":{"$error":"#N/A"}}]
[null,"CROSS-CHECK LOG"]
[null,"This Log is used to verify that the Official Race Scorer has correctly entered the data from the Contestant's Log.  \nPlease cross-check it against your Log to make sure there are no discrepancies."]
[]
[]
[null,"CONTEST NAME:",null,{"$f":"Contest_Name","v":"Stimson"},null,null,null,null,null,null,null,null,null,"DATE:",null,null,null,{"$f":"Contest_Date","v":"2018-09-15"},null,null,null,null,null,null,null,null,null,null," "]
[null,"CONTESTANT:",null,{"$f":"INDEX(Contestant_Names,,$A$2)","v":{"$error":"#N/A"}},null,null,null,null,null,null,null,null,null,"BOAT NAME:",null,null,null,{"$f":"INDEX(Boat_Names,,$A$2)","v":{"$error":"#N/A"}}]
[]
[null,"from CONTESTANT PREDICTED LOG",null,null,null,null,"from CONTEST LOG",null,null,null,null,null,null,"TIME OUT(S)",null,null,null,null,null,null,"ACTUAL RESULTS"]
{"$rows_left_out":33}
{"sheet":"Class Certificates","index":12,"n_rows":50,"n_cols":1,"rows_kept":50,"cut":false,"hidden":false,"merged":[]}
[{"$f":"\"Class 1 - 2nd Place \"&YEAR(Contest_Date)","v":"Class 1 - 2nd Place 2018"}]
[]
[{"$f":"LOOKUP('Class Results'!D15,'Yacht Clubs'!A2:B11)","v":{"$error":"#N/A"}}]
[{"$f":"TEXT('Class Results'!E15,\"0.0000%\")&\" Error\"","v":" Error"}]
[{"$f":"'Class Results'!A15&\" - \"&'Class Results'!B15&\"/\"&'Class Results'!C15","v":" - /"}]
[{"$f":"\"Class 1 - 3rd Place \"&YEAR(Contest_Date)","v":"Class 1 - 3rd Place 2018"}]
[]
[{"$f":"LOOKUP('Class Results'!D16,'Yacht Clubs'!A2:B11)","v":{"$error":"#N/A"}}]
[{"$f":"TEXT('Class Results'!E16,\"0.0000%\")&\" Error\"","v":" Error"}]
[{"$f":"'Class Results'!A16&\" - \"&'Class Results'!B16&\"/\"&'Class Results'!C16","v":" - /"}]
{"$rows_left_out":41}
{"sheet":"Yacht Clubs","index":13,"n_rows":11,"n_cols":2,"rows_kept":11,"cut":false,"hidden":false,"merged":[]}
["Yacht Clubs (in alphabetical order)"]
["BYC","Bremerton Yacht Club"]
["GHYC","Gig Harbor Yacht Club"]
["MBYC","Meydenbauer Bay Yacht Club"]
["POYC","Port Orchard Yacht Club"]
["PYC","Poulsbo Yacht Club"]
["QCYC","Queen City Yacht Club"]
["RYC","Rainier Yacht Club"]
["SYC","Seattle Yacht Club"]
["Totem YC","Totem Yacht Club"]
{"$rows_left_out":2}
{"sheet":"Contestants","index":14,"n_rows":161,"n_cols":8,"rows_kept":161,"cut":false,"hidden":false,"merged":[]}
["IPBA #","Contestant","Navigator","Boat Name","Club","Cruise","Slow","Class"]
[624,"Steve Hazlerig","Zach Johnson","Solara","SYC",8.8870000000000005,6.9930000000000003,3]
[600,"Bob Lindal","Mike McGillin","SUZY Q - A","QCYC",10.039999999999999,6.923,5]
[539,"Scott Strandjord","Jim V / Tyler S","Redemption","SYC",9.0730000000000004,6.9930000000000003,4]
[165,"Brent Reys","Alex Lorenz","PANACHE","SYC",9.4740000000000002,6.923,4]
[7,"Jim Korzetz","Dick Timmerman","FREEDOM","PYC",8.39,7,2]
[511,"Fred Cole","Linda Cole","Mouse Trap","POYC",9.5549999999999997,7,5]
[688,"George Gregg","Bob Johnson","Noble","PYC",7.8470000000000004,7,1]
[715,"Eva Bennison","Dick Bennison","Well Done","TYC",9.5079999999999991,7,5]
[689,"Clint Chapin","Lynn Hvalsoe","Sojourn","MBYC",7.3,7,1]
{"$rows_left_out":151}