{"text_format":"1","workbook":"xlsx","n_sheets":15,"sheets":["Instructions","Contest Entry","Log Entry","Start Times","Overall Results","Class Results","Novice Results","Boats & Observers","Club Participation","Team Trophy","Leg Scores","Cross-Check Log","Class Certificates","Yacht Clubs","Contestants"],"not_rendered":{"charts":0,"images":28,"macros":1,"external_links":0,"defined_names":119,"comments":0,"pivot_tables":0},"unopened":[],"bounds":{"document_bytes":16777216,"sheet_cells":100000,"rows_first":2000,"rows_last":500,"rows_between":2000,"halvings":0,"cell_chars":16384,"cell_head_chars":4096},"cells_cut":0,"cells_raw":0,"read":"whole","date_system":"1900"}

{"sheet":"Instructions","index":0,"n_rows":44,"n_cols":3,"rows_kept":44,"cut":false,"hidden":false,"merged":[]}
[null,"SYC Predicted Log Race Scoring Spreadsheet"]
[null,"© 2012-2013 Steve Hazlerig"]
[null,"Email: steve@hazlerig.com"]
[]
[null,"This spreadsheet is used by yacht clubs to score Predicted Log Race (Cruiser Navigation) contests."]
[]
[null,"Instructions"]
[]
[null,"1) In general, enter data only in the cells and sheets that are highlighted in Yellow.  All of the Green sheets are calculated from data entered in the Yellow sheets."]
[null,"2) Start by entering contest-specific information into the \"Contest Entry\" sheet."]
[null,null,"a) If the spreadsheet still has a previous contest in it, click \"Reset Entire Spreadsheet for New Contest\" to clear out the previous contest data."]
[null,null,"b) Enter the contest data into the appropriate cells: Club Name, Contest Name, Date, Official Mileage, Number of Contestants Expected (if known)."]
[null,null,"c) Enter the Number of Control Points, Number of Classes, and Team Size for your contest."]
[null,null,"d) Edit the \"Class Table\" Speeds and Finish Times for your contest"]
[null,null,"e) If there is a Club Logo above the \"Print All Results\" button, drag it out of the way.  Then drag your Club's Logo into the \"Logo\" box so it will appear on each sheet."]
[null,"3) Before the contest, enter all contestant registration information into the \"Log Entry\" sheet."]
[null,null,"a) As you receive registration information, you can start to pre-enter contestants in the top section of this sheet."]
[null,null,"b) Start by typing the contestant's IPBA Number or boat name in the row provided.  If the contestant is found in the \"Contestants\" sheet, then the rest of the information will be pre-filled."]
[null,null,"c) If you need to change any of the information associated with the contestant, change it in the \"Log Entry\" sheet and it will be updated into the \"Contestants\" sheet."]
[null,null,"d) If the contestant is not found by IPBA Number or boat name, then type in the contestant information in the \"Log Entry\" sheet and it will be added to the \"Contestants\" sheet."]
[null,null,"e) If the contestant does not have an IPBA Number, then either have one assigned or make up an unused number.  IPBA Numbers must be unique."]
[null,null,"f) While entering contestants, you can always go to the first empty column (to enter the next contestant) by typing \"Control-N\""]
[null,null,"g) Observers can be pre-assigned and entered into the appropriate row in the \"Log Entry\" sheet."]
[null,null,"h) New Yacht Club names should be entered in the \"Yacht Clubs\" sheet.  These are only used for printing the \"optional\" Certificates."]
[null,"4) On the morning of the contest, as Predicted Logs are received, enter the Distances and Predicted Times in the appropriate rows of the \"Log Entry\" sheet."]
[null,null,"a) To assist with finding a contestant, type \"Control-G\" on the keyboard.  A box will come up with a list of all contestants by boat name.  Choose the contestant and click OK."]
[null,null,"b) Errors in the contestant data will be highlighted in red."]
[null,null,"c) After entering the Predicted Log, you can (optionally) click the Print button in the contestant's column to print a \"Cross-Check Log\" to give to the contestant."]
[null,null,"d) After entering each Predicted Log, check the \"Total Predicted Seconds\" and the \"Total Predicted Mileage\" against the Log for errors."]
[null,null,"e) As Predicted Logs are entered, the \"Start Times\" sheet will be updated in real time and can be printed out manually as needed, or displayed with a projector."]
[null,null,"f) As you enter logs, the \"Predicted Logs Entered\" cell in the \"Contest Entry\" sheet will update.  It will highlight Red until all Predicted Logs are entered."]
[null,null,"g) If you need to delete a contestant for any reason, select their IPBA Number, hit Backspace to delete it, and then hit Enter.  This is currently the only correct way."]
[null,null,"h) After all Predicted Logs are entered, click the \"Print All Start Times\" button on the \"Contest Entry\" sheet to print Start Times for all contestants."]
[null,"5) After the contest, as Contest Logs are received, enter the Actual Times and Times Outs (if any) in the appropriate rows of the \"Log Entry\" sheet."]
[null,null,"a) To assist with finding a contestant, type \"Control-G\" on the keyboard.  A box will come up with a list of all contestants by boat name.  Choose the contestant and click OK."]
[null,null,"b) After entering each Contest Log, check the \"Total Seconds of Error\" against the Log for errors."]
[null,null,"c) As Contest Logs are entered, the green sheets (Overall Results, Class Results, etc.) will be updated in real time."]
[null,null,"d) As you enter logs, the \"Contest Logs Entered\" cell in the \"Contest Entry\" sheet will update.  It will highlight Red until all Actual Logs are entered."]
[null,null,"e) After all Contest Logs are entered, click the \"Print All Results\" button on the \"Contest Entry\" sheet to print all results documents"]
[null,null,"f) If you wish to print Certificates for 2nd and 3rd in each Class, click on the \"Certificates\" sheet and use Excel's Print command."]
[null,"6) Be sure to save your work often, and make backup copies as needed to avoid losing information."]
[null,"7) After the contest, if you have added contestants or changed contestant information (such as Navigator, Boat Name, Speed, or Class), or added Yacht Club names,"]
[null,null,"please email a copy of this spreadsheet to steve@hazlerig.com, so that the new contestant and club information will be carried forward to the next contest."]
[null,"8) Please send any feedback or bug reports directly to me at steve@hazlerig.com."]

{"sheet":"Contest Entry","index":1,"n_rows":32,"n_cols":9,"rows_kept":32,"cut":false,"hidden":false,"merged":[[25,8,25,9],[26,8,26,9],[11,1,11,4],[10,1,10,4],[0,1,0,4],[1,1,1,4],[2,1,2,4],[3,1,3,4],[5,1,5,4],[9,1,9,4],[8,1,8,4],[4,1,4,4],[6,1,6,4],[7,1,7,4]]}
["Club Name:","SYC"]
["Contest Name:","Stimson"]
["Contest Date:","2018-09-15"]
["Official Mileage:",14]
["Contestants Expected:",9,null,null,null,"(1-48)"]
["Contestants Entered:",{"$f":"COUNTA(IPBA_Numbers)","v":9}]
["Predicted Logs Entered:",{"$f":"COUNT(Predicted_Start_Times)","v":9}]
["Contest Logs Entered:",{"$f":"COUNT(Actual_Start_Times)","v":9}]
["Number of Novices:",{"$f":"COUNT(Novice_Rank)","v":1},{"$f":"COUNT('Log Entry'!79:79)+ROW()","v":15},{"$f":"COUNT('Log Entry'!79:79)+ROW()","v":15},{"$f":"COUNT('Log Entry'!79:79)+ROW()","v":15}]
["Number of Control Points:",4,null,null,null,"(1 - 8)"]
["Number of Classes:",5,null,null,null,"(3 - 5)"]
["Team Size:",3,null,null,null,"(2 - 5)"]
["Use Handicap?","Yes"]
[]
["Class Table","Speed >","Speed <=","Finish Min","Finish Max"]
["Class 1:","below",8,1450,1500]
["Class 2:",{"$f":"C16","v":8},8.5,1505,1515]
["Class 3:",{"$f":"C17","v":8.5},9,1520,1530]
["Class 4:",9,9.5,1535,1545]
["Class 5:",9.5,"above",1550,1600]
[]
["Class Divisor:",{"$f":"(B8-3)/B11","v":1.2},null,null,null,"( <= 9.0 )"]
[]
[]
[]
[null,null,null,null,null,null,null,null,"Logo"]
[]
[]
[]
[]
[]
[null,null,null,null,null,null,null,null,false]

{"sheet":"Log Entry","index":2,"n_rows":87,"n_cols":62,"rows_kept":87,"cut":false,"hidden":false,"merged":[[31,0,31,1],[58,0,58,1],[85,0,85,1],[86,0,86,1],[0,0,0,1],[5,0,5,1],[6,0,6,1],[80,0,80,1],[75,0,75,1],[76,0,76,1],[77,0,77,1],[78,0,78,1],[79,0,79,1],[1,0,1,1],[2,0,2,1],[7,0,7,1],[3,0,3,1],[4,0,4,1],[10,0,10,1],[20,0,20,1],[21,0,21,1],[8,0,8,1],[11,0,11,1],[71,0,71,1],[83,0,83,1],[84,0,84,1],[9,0,9,1],[74,0,74,1],[59,0,59,1],[69,0,69,1],[32,0,32,1],[73,0,73,1],[30,0,30,1],[33,0,33,1],[68,0,68,1],[70,0,70,1],[72,0,72,1],[82,0,82,1],[81,0,81,1]]}
["IPBA Number",null,165,null,689,7,694,677,120,663,533,1100]
["Contestant Name",null,"Brent Reys",null,"Clint Chapin","Jim Korzetz","Jim VanAntwerp","Ken Case","Mike Henry","Larry O'Keefe","Team Klett/Elbon/Cullen","Dan DeGard",null,null,null,null,null,null,null,null,null,null,null,null,null,null,null,null,null,null,null,null,null,null,null,null,null,null,null,null,null,null,null,null,null,null,null,null,null,null,{"$f":"IFERROR(VLOOKUP(AY$1,Contestants!$A:$H,ROW(),FALSE),\"\")","v":""},{"$f":"IFERROR(VLOOKUP(AZ$1,Contestants!$A:$H,ROW(),FALSE),\"\")","v":""},{"$f":"IFERROR(VLOOKUP(BA$1,Contestants!$A:$H,ROW(),FALSE),\"\")","v":""},{"$f":"IFERROR(VLOOKUP(BB$1,Contestants!$A:$H,ROW(),FALSE),\"\")","v":""},{"$f":"IFERROR(VLOOKUP(BC$1,Contestants!$A:$H,ROW(),FALSE),\"\")","v":""},{"$f":"IFERROR(VLOOKUP(BD$1,Contestants!$A:$H,ROW(),FALSE),\"\")","v":""},{"$f":"IFERROR(VLOOKUP(BE$1,Contestants!$A:$H,ROW(),FALSE),\"\")","v":""},{"$f":"IFERROR(VLOOKUP(BF$1,Contestants!$A:$H,ROW(),FALSE),\"\")","v":""},{"$f":"IFERROR(VLOOKUP(BG$1,Contestants!$A:$H,ROW(),FALSE),\"\")","v":""},{"$f":"IFERROR(VLOOKUP(BH$1,Contestants!$A:$H,ROW(),FALSE),\"\")","v":""},{"$f":"IFERROR(VLOOKUP(BI$1,Contestants!$A:$H,ROW(),FALSE),\"\")","v":""},{"$f":"IFERROR(VLOOKUP(BJ$1,Contestants!$A:$H,ROW(),FALSE),\"\")","v":""}]
["Navigator Name(s)",null,"Alex Lorenz",null,"Lynn Hvalsoe","Dick Timmerman","OJ Potter","Debbie Case","Billie Henry","Ted Burns","Elbon/Klett","JJ Johnson",null,null,null,null,null,null,null,null,null,null,null,null,null,null,null,null,null,null,null,null,null,null,null,null,null,null,null,null,null,null,null,null,null,null,null,null,null,null,{"$f":"IFERROR(VLOOKUP(AY$1,Contestants!$A:$H,ROW(),FALSE),\"\")","v":""},{"$f":"IFERROR(VLOOKUP(AZ$1,Contestants!$A:$H,ROW(),FALSE),\"\")","v":""},{"$f":"IFERROR(VLOOKUP(BA$1,Contestants!$A:$H,ROW(),FALSE),\"\")","v":""},{"$f":"IFERROR(VLOOKUP(BB$1,Contestants!$A:$H,ROW(),FALSE),\"\")","v":""},{"$f":"IFERROR(VLOOKUP(BC$1,Contestants!$A:$H,ROW(),FALSE),\"\")","v":""},{"$f":"IFERROR(VLOOKUP(BD$1,Contestants!$A:$H,ROW(),FALSE),\"\")","v":""},{"$f":"IFERROR(VLOOKUP(BE$1,Contestants!$A:$H,ROW(),FALSE),\"\")","v":""},{"$f":"IFERROR(VLOOKUP(BF$1,Contestants!$A:$H,ROW(),FALSE),\"\")","v":""},{"$f":"IFERROR(VLOOKUP(BG$1,Contestants!$A:$H,ROW(),FALSE),\"\")","v":""},{"$f":"IFERROR(VLOOKUP(BH$1,Contestants!$A:$H,ROW(),FALSE),\"\")","v":""},{"$f":"IFERROR(VLOOKUP(BI$1,Contestants!$A:$H,ROW(),FALSE),\"\")","v":""},{"$f":"IFERROR(VLOOKUP(BJ$1,Contestants!$A:$H,ROW(),FALSE),\"\")","v":""}]
["Boat Name",null,"PANACHE",null,"SOJOURN","FREEDOM","SARAH B","RAZZLE","PEACHY KEEN","MISS MIRANDA","KLETTITAT","SAGA",null,null,null,null,null,null,null,null,null,null,null,null,null,null,null,null,null,null,null,null,null,null,null,null,null,null,null,null,null,null,null,null,null,null,null,null,null,null,{"$f":"IFERROR(UPPER(VLOOKUP(AY$1,Contestants!$A:$H,ROW(),FALSE)),\"\")","v":""},{"$f":"IFERROR(UPPER(VLOOKUP(AZ$1,Contestants!$A:$H,ROW(),FALSE)),\"\")","v":""},{"$f":"IFERROR(UPPER(VLOOKUP(BA$1,Contestants!$A:$H,ROW(),FALSE)),\"\")","v":""},{"$f":"IFERROR(UPPER(VLOOKUP(BB$1,Contestants!$A:$H,ROW(),FALSE)),\"\")","v":""},{"$f":"IFERROR(UPPER(VLOOKUP(BC$1,Contestants!$A:$H,ROW(),FALSE)),\"\")","v":""},{"$f":"IFERROR(UPPER(VLOOKUP(BD$1,Contestants!$A:$H,ROW(),FALSE)),\"\")","v":""},{"$f":"IFERROR(UPPER(VLOOKUP(BE$1,Contestants!$A:$H,ROW(),FALSE)),\"\")","v":""},{"$f":"IFERROR(UPPER(VLOOKUP(BF$1,Contestants!$A:$H,ROW(),FALSE)),\"\")","v":""},{"$f":"IFERROR(UPPER(VLOOKUP(BG$1,Contestants!$A:$H,ROW(),FALSE)),\"\")","v":""},{"$f":"IFERROR(UPPER(VLOOKUP(BH$1,Contestants!$A:$H,ROW(),FALSE)),\"\")","v":""},{"$f":"IFERROR(UPPER(VLOOKUP(BI$1,Contestants!$A:$H,ROW(),FALSE)),\"\")","v":""},{"$f":"IFERROR(UPPER(VLOOKUP(BJ$1,Contestants!$A:$H,ROW(),FALSE)),\"\")","v":""}]
["Yacht Club",null,"SYC",null,"MBYC","PYC","BYC","SYC","BYC","SYC","QCYC","BYC",null,null,null,null,null,null,null,null,null,null,null,null,null,null,null,null,null,null,null,null,null,null,null,null,null,null,null,null,null,null,null,null,null,null,null,null,null,null,{"$f":"IFERROR(VLOOKUP(AY$1,Contestants!$A:$H,ROW(),FALSE),\"\")","v":""},{"$f":"IFERROR(VLOOKUP(AZ$1,Contestants!$A:$H,ROW(),FALSE),\"\")","v":""},{"$f":"IFERROR(VLOOKUP(BA$1,Contestants!$A:$H,ROW(),FALSE),\"\")","v":""},{"$f":"IFERROR(VLOOKUP(BB$1,Contestants!$A:$H,ROW(),FALSE),\"\")","v":""},{"$f":"IFERROR(VLOOKUP(BC$1,Contestants!$A:$H,ROW(),FALSE),\"\")","v":""},{"$f":"IFERROR(VLOOKUP(BD$1,Contestants!$A:$H,ROW(),FALSE),\"\")","v":""},{"$f":"IFERROR(VLOOKUP(BE$1,Contestants!$A:$H,ROW(),FALSE),\"\")","v":""},{"$f":"IFERROR(VLOOKUP(BF$1,Contestants!$A:$H,ROW(),FALSE),\"\")","v":""},{"$f":"IFERROR(VLOOKUP(BG$1,Contestants!$A:$H,ROW(),FALSE),\"\")","v":""},{"$f":"IFERROR(VLOOKUP(BH$1,Contestants!$A:$H,ROW(),FALSE),\"\")","v":""},{"$f":"IFERROR(VLOOKUP(BI$1,Contestants!$A:$H,ROW(),FALSE),\"\")","v":""},{"$f":"IFERROR(VLOOKUP(BJ$1,Contestants!$A:$H,ROW(),FALSE),\"\")","v":""}]
["Cruise Speed",null,9.4740000000000002,null,7.3,8.39,7,9.89,8.1750000000000007,8.5920000000000005,9.61,8,null,null,null,null,null,null,null,null,null,null,null,null,null,null,null,null,null,null,null,null,null,null,null,null,null,null,null,null,null,null,null,null,null,null,null,null,null,null,{"$f":"IFERROR(VLOOKUP(AY$1,Contestants!$A:$H,ROW(),FALSE),\"\")","v":""},{"$f":"IFERROR(VLOOKUP(AZ$1,Contestants!$A:$H,ROW(),FALSE),\"\")","v":""},{"$f":"IFERROR(VLOOKUP(BA$1,Contestants!$A:$H,ROW(),FALSE),\"\")","v":""},{"$f":"IFERROR(VLOOKUP(BB$1,Contestants!$A:$H,ROW(),FALSE),\"\")","v":""},{"$f":"IFERROR(VLOOKUP(BC$1,Contestants!$A:$H,ROW(),FALSE),\"\")","v":""},{"$f":"IFERROR(VLOOKUP(BD$1,Contestants!$A:$H,ROW(),FALSE),\"\")","v":""},{"$f":"IFERROR(VLOOKUP(BE$1,Contestants!$A:$H,ROW(),FALSE),\"\")","v":""},{"$f":"IFERROR(VLOOKUP(BF$1,Contestants!$A:$H,ROW(),FALSE),\"\")","v":""},{"$f":"IFERROR(VLOOKUP(BG$1,Contestants!$A:$H,ROW(),FALSE),\"\")","v":""},{"$f":"IFERROR(VLOOKUP(BH$1,Contestants!$A:$H,ROW(),FALSE),\"\")","v":""},{"$f":"IFERROR(VLOOKUP(BI$1,Contestants!$A:$H,ROW(),FALSE),\"\")","v":""},{"$f":"IFERROR(VLOOKUP(BJ$1,Contestants!$A:$H,ROW(),FALSE),\"\")","v":""}]
["Slow Speed",null,6.923,7,7,7,null,7,7,null,null,null,null,null,null,null,null,null,null,null,null,null,null,null,null,null,null,null,null,null,null,null,null,null,null,null,null,null,null,null,null,null,null,null,null,null,null,null,null,null,{"$f":"IFERROR(VLOOKUP(AY$1,Contestants!$A:$H,ROW(),FALSE),\"\")","v":""},{"$f":"IFERROR(VLOOKUP(AZ$1,Contestants!$A:$H,ROW(),FALSE),\"\")","v":""},{"$f":"IFERROR(VLOOKUP(BA$1,Contestants!$A:$H,ROW(),FALSE),\"\")","v":""},{"$f":"IFERROR(VLOOKUP(BB$1,Contestants!$A:$H,ROW(),FALSE),\"\")","v":""},{"$f":"IFERROR(VLOOKUP(BC$1,Contestants!$A:$H,ROW(),FALSE),\"\")","v":""},{"$f":"IFERROR(VLOOKUP(BD$1,Contestants!$A:$H,ROW(),FALSE),\"\")","v":""},{"$f":"IFERROR(VLOOKUP(BE$1,Contestants!$A:$H,ROW(),FALSE),\"\")","v":""},{"$f":"IFERROR(VLOOKUP(BF$1,Contestants!$A:$H,ROW(),FALSE),\"\")","v":""},{"$f":"IFERROR(VLOOKUP(BG$1,Contestants!$A:$H,ROW(),FALSE),\"\")","v":""},{"$f":"IFERROR(VLOOKUP(BH$1,Contestants!$A:$H,ROW(),FALSE),\"\")","v":""},{"$f":"IFERROR(VLOOKUP(BI$1,Contestants!$A:$H,ROW(),FALSE),\"\")","v":""},{"$f":"IFERROR(VLOOKUP(BJ$1,Contestants!$A:$H,ROW(),FALSE),\"\")","v":""}]
["Finish Class",null,4,null,1,2,1,5,2,3,5,1,null,null,null,null,null,null,null,null,null,null,null,null,null,null,null,null,null,null,null,null,null,null,null,null,null,null,null,null,null,null,null,null,null,null,null,null,null,null,{"$f":"IFERROR(VLOOKUP(AY$1,Contestants!$A:$H,ROW(),FALSE),\"\")","v":""},{"$f":"IFERROR(VLOOKUP(AZ$1,Contestants!$A:$H,ROW(),FALSE),\"\")","v":""},{"$f":"IFERROR(VLOOKUP(BA$1,Contestants!$A:$H,ROW(),FALSE),\"\")","v":""},{"$f":"IFERROR(VLOOKUP(BB$1,Contestants!$A:$H,ROW(),FALSE),\"\")","v":""},{"$f":"IFERROR(VLOOKUP(BC$1,Contestants!$A:$H,ROW(),FALSE),\"\")","v":""},{"$f":"IFERROR(VLOOKUP(BD$1,Contestants!$A:$H,ROW(),FALSE),\"\")","v":""},{"$f":"IFERROR(VLOOKUP(BE$1,Contestants!$A:$H,ROW(),FALSE),\"\")","v":""},{"$f":"IFERROR(VLOOKUP(BF$1,Contestants!$A:$H,ROW(),FALSE),\"\")","v":""},{"$f":"IFERROR(VLOOKUP(BG$1,Contestants!$A:$H,ROW(),FALSE),\"\")","v":""},{"$f":"IFERROR(VLOOKUP(BH$1,Contestants!$A:$H,ROW(),FALSE),\"\")","v":""},{"$f":"IFERROR(VLOOKUP(BI$1,Contestants!$A:$H,ROW(),FALSE),\"\")","v":""},{"$f":"IFERROR(VLOOKUP(BJ$1,Contestants!$A:$H,ROW(),FALSE),\"\")","v":""}]
["Observer"]
["Racing Less Than 3 Years"]
["Novice",null,null,null,null,null,null,null,null,null,null,"Yes"]
["Print This Contestant"]
["Distances","CP1",3.74,null,3.7730000000000001,3.7909999999999999,3.97,3.7080000000000002,3.77,3.7320000000000002,3.7050000000000001,3.92]
[null,"CP2",2.9580000000000002,null,2.9609999999999999,2.9239999999999999,2.98,2.9630000000000001,2.9,2.96,2.9790000000000001,2.91]
[null,"CP3",3.948,null,4.0839999999999996,3.9910000000000001,4.07,3.9489999999999998,4.0599999999999996,3.9260000000000002,3.9079999999999999,3.93]
[null,"CP4",2.9769999999999999,null,2.9569999999999999,3.044,2.98,2.9929999999999999,2.98,2.9980000000000002,2.99,2.93]
[null,"CP5"]
[null,"CP6"]
[null,"CP7"]
[null,"CP8"]
["Total Predicted Mileage",null,{"$f":"SUM(C13:C20)","v":13.623000000000001},{"$f":"SUM(D13:D20)","v":0},13.774999999999999,13.75,14,13.613000000000001,13.71,13.616,13.582000000000001,{"$f":"SUM(L13:L20)","v":13.69},0,{"$f":"SUM(N13:N20)","v":0},0,0,0,0,0,0,0,0,0,0,0,0,0,0,0,0,0,0,0,0,0,0,0,0,0,0,0,0,0,0,0,0,0,0,0,0,0,0,0,0,0,0,0,0,{"$f":"SUM(BG13:BG20)","v":0},0,0,0]
["Predicted Start Time",null,140748,null,123238,131939,124516,142120,131621,134614,141816,130732]
["Predicted Run Times","CP1",2409,null,3118,2837,3457,2249,2903,2714,2347,3023]
[null,"CP2",2214,null,2723,2531,3040,2311,2628,2528,2236,2631]
[null,"CP3",2512,null,3430,2846,3517,2411,3039,2809,2437,2905]
[null,"CP4",2037,null,2411,2227,2350,2129,2232,2243,2044,2129]
[null,"CP5"]
[null,"CP6"]
[null,"CP7"]
[null,"CP8"]
["Total Predicted Run Time",null,{"$f":"HoursMinutesAndSeconds(C33)","v":13212},{"$f":"HoursMinutesAndSeconds(D33)","v":0},15722,14521,20444,13140,14842,14334,13144,14728,0,0,0,0,0,0,0,0,0,0,0,0,0,0,0,0,0,0,0,0,0,0,0,0,0,0,0,0,0,0,0,0,0,0,0,0,0,0,0,0,0,0,0,0,0,0,{"$f":"HoursMinutesAndSeconds(BG33)","v":0},0,0,0]
["Predicted Finish Time",null,{"$f":"HoursMinutesAndSeconds(seconds(C22)+C33)","v":154000},{"$f":"HoursMinutesAndSeconds(seconds(D22)+D33)","v":0},{"$f":"HoursMinutesAndSeconds(seconds(E22)+E33)","v":143000},{"$f":"HoursMinutesAndSeconds(seconds(F22)+F33)","v":150500},{"$f":"HoursMinutesAndSeconds(seconds(G22)+G33)","v":145000},{"$f":"HoursMinutesAndSeconds(seconds(H22)+H33)","v":155300},{"$f":"HoursMinutesAndSeconds(seconds(I22)+I33)","v":150503},{"$f":"HoursMinutesAndSeconds(seconds(J22)+J33)","v":152948},{"$f":"HoursMinutesAndSeconds(seconds(K22)+K33)","v":155000},{"$f":"HoursMinutesAndSeconds(seconds(L22)+L33)","v":145500},{"$f":"HoursMinutesAndSeconds(seconds(M22)+M33)","v":0},{"$f":"HoursMinutesAndSeconds(seconds(N22)+N33)","v":0},{"$f":"HoursMinutesAndSeconds(seconds(O22)+O33)","v":0},{"$f":"HoursMinutesAndSeconds(seconds(P22)+P33)","v":0},{"$f":"HoursMinutesAndSeconds(seconds(Q22)+Q33)","v":0},{"$f":"HoursMinutesAndSeconds(seconds(R22)+R33)","v":0},{"$f":"HoursMinutesAndSeconds(seconds(S22)+S33)","v":0},{"$f":"HoursMinutesAndSeconds(seconds(T22)+T33)","v":0},{"$f":"HoursMinutesAndSeconds(seconds(U22)+U33)","v":0},{"$f":"HoursMinutesAndSeconds(seconds(V22)+V33)","v":0},{"$f":"HoursMinutesAndSeconds(seconds(W22)+W33)","v":0},{"$f":"HoursMinutesAndSeconds(seconds(X22)+X33)","v":0},{"$f":"HoursMinutesAndSeconds(seconds(Y22)+Y33)","v":0},{"$f":"HoursMinutesAndSeconds(seconds(Z22)+Z33)","v":0},{"$f":"HoursMinutesAndSeconds(seconds(AA22)+AA33)","v":0},{"$f":"HoursMinutesAndSeconds(seconds(AB22)+AB33)","v":0},{"$f":"HoursMinutesAndSeconds(seconds(AC22)+AC33)","v":0},{"$f":"HoursMinutesAndSeconds(seconds(AD22)+AD33)","v":0},{"$f":"HoursMinutesAndSeconds(seconds(AE22)+AE33)","v":0},{"$f":"HoursMinutesAndSeconds(seconds(AF22)+AF33)","v":0},{"$f":"HoursMinutesAndSeconds(seconds(AG22)+AG33)","v":0},{"$f":"HoursMinutesAndSeconds(seconds(AH22)+AH33)","v":0},{"$f":"HoursMinutesAndSeconds(seconds(AI22)+AI33)","v":0},{"$f":"HoursMinutesAndSeconds(seconds(AJ22)+AJ33)","v":0},{"$f":"HoursMinutesAndSeconds(seconds(AK22)+AK33)","v":0},{"$f":"HoursMinutesAndSeconds(seconds(AL22)+AL33)","v":0},{"$f":"HoursMinutesAndSeconds(seconds(AM22)+AM33)","v":0},{"$f":"HoursMinutesAndSeconds(seconds(AN22)+AN33)","v":0},{"$f":"HoursMinutesAndSeconds(seconds(AO22)+AO33)","v":0},{"$f":"HoursMinutesAndSeconds(seconds(AP22)+AP33)","v":0},{"$f":"HoursMinutesAndSeconds(seconds(AQ22)+AQ33)","v":0},{"$f":"HoursMinutesAndSeconds(seconds(AR22)+AR33)","v":0},{"$f":"HoursMinutesAndSeconds(seconds(AS22)+AS33)","v":0},{"$f":"HoursMinutesAndSeconds(seconds(AT22)+AT33)","v":0},{"$f":"HoursMinutesAndSeconds(seconds(AU22)+AU33)","v":0},{"$f":"HoursMinutesAndSeconds(seconds(AV22)+AV33)","v":0},{"$f":"HoursMinutesAndSeconds(seconds(AW22)+AW33)","v":0},{"$f":"HoursMinutesAndSeconds(seconds(AX22)+AX33)","v":0},{"$f":"HoursMinutesAndSeconds(seconds(AY22)+AY33)","v":0},{"$f":"HoursMinutesAndSeconds(seconds(AZ22)+AZ33)","v":0},{"$f":"HoursMinutesAndSeconds(seconds(BA22)+BA33)","v":0},{"$f":"HoursMinutesAndSeconds(seconds(BB22)+BB33)","v":0},{"$f":"HoursMinutesAndSeconds(seconds(BC22)+BC33)","v":0},{"$f":"HoursMinutesAndSeconds(seconds(BD22)+BD33)","v":0},{"$f":"HoursMinutesAndSeconds(seconds(BE22)+BE33)","v":0},{"$f":"HoursMinutesAndSeconds(seconds(BF22)+BF33)","v":0},{"$f":"HoursMinutesAndSeconds(seconds(BG22)+BG33)","v":0},{"$f":"HoursMinutesAndSeconds(seconds(BH22)+BH33)","v":0},{"$f":"HoursMinutesAndSeconds(seconds(BI22)+BI33)","v":0},{"$f":"HoursMinutesAndSeconds(seconds(BJ22)+BJ33)","v":0}]
["Total Predicted Seconds",null,{"$f":"seconds(C23)+seconds(C24)+seconds(C25)+seconds(C26)+seconds(C27)+seconds(C28)+seconds(C29)+seconds(C30)","v":5532},0,7042,6321,7484,5500,6522,6214,5504,{"$f":"seconds(L23)+seconds(L24)+seconds(L25)+seconds(L26)+seconds(L27)+seconds(L28)+seconds(L29)+seconds(L30)","v":6448},0,{"$f":"seconds(N23)+seconds(N24)+seconds(N25)+seconds(N26)+seconds(N27)+seconds(N28)+seconds(N29)+seconds(N30)","v":0},0,0,0,0,0,0,0,0,0,0,{"$f":"seconds(Y23)+seconds(Y24)+seconds(Y25)+seconds(Y26)+seconds(Y27)+seconds(Y28)+seconds(Y29)+seconds(Y30)","v":0},0,0,0,0,0,0,0,0,0,0,0,0,0,0,0,0,0,0,0,0,0,0,0,0,0,0,0,0,0,0,0,0,0,{"$f":"seconds(BG23)+seconds(BG24)+seconds(BG25)+seconds(BG26)+seconds(BG27)+seconds(BG28)+seconds(BG29)+seconds(BG30)","v":0},0,0,0]
["Actual Start Time",null,140451,null,122911,131707,124343,142025,131958,134349,141441,130802]
["Actual Times","CP1",142950,null,130050,134544,131840,144352,134838,141048,143911,133808]
[null,"CP2",145221,null,132714,141118,134931,150905,141507,143617,150118,140540]
[null,"CP3",151744,null,140114,144009,142508,153238,144529,150343,152601,143440]
[null,"CP4",153804,null,142536,150244,144848,155419,150804,152623,154643,145645]
[null,"CP5"]
[null,"CP6"]
[null,"CP7"]
[null,"CP8"]
["Time Outs","CP1"]
[null,"CP2"]
[null,"CP3"]
[null,"CP4"]
[null,"CP5"]
[null,"CP6"]
[null,"CP7"]
[null,"CP8"]
["Actual Run Times","CP1",{"$f":"IF(ISBLANK(C35),0,HoursMinutesAndSeconds(seconds(C35)-seconds(C34)-seconds(C43)))","v":2459},{"$f":"IF(ISBLANK(D35),0,HoursMinutesAndSeconds(seconds(D35)-seconds(D34)-seconds(D43)))","v":0},{"$f":"IF(ISBLANK(E35),0,HoursMinutesAndSeconds(seconds(E35)-seconds(E34)-seconds(E43)))","v":3139},{"$f":"IF(ISBLANK(F35),0,HoursMinutesAndSeconds(seconds(F35)-seconds(F34)-seconds(F43)))","v":2837},{"$f":"IF(ISBLANK(G35),0,HoursMinutesAndSeconds(seconds(G35)-seconds(G34)-seconds(G43)))","v":3457},{"$f":"IF(ISBLANK(H35),0,HoursMinutesAndSeconds(seconds(H35)-seconds(H34)-seconds(H43)))","v":2327},{"$f":"IF(ISBLANK(I35),0,HoursMinutesAndSeconds(seconds(I35)-seconds(I34)-seconds(I43)))","v":2840},{"$f":"IF(ISBLANK(J35),0,HoursMinutesAndSeconds(seconds(J35)-seconds(J34)-seconds(J43)))","v":2659},{"$f":"IF(ISBLANK(K35),0,HoursMinutesAndSeconds(seconds(K35)-seconds(K34)-seconds(K43)))","v":2430},{"$f":"IF(ISBLANK(L35),0,HoursMinutesAndSeconds(seconds(L35)-seconds(L34)-seconds(L43)))","v":3006},{"$f":"IF(ISBLANK(M35),0,HoursMinutesAndSeconds(seconds(M35)-seconds(M34)-seconds(M43)))","v":0},{"$f":"IF(ISBLANK(N35),0,HoursMinutesAndSeconds(seconds(N35)-seconds(N34)-seconds(N43)))","v":0},{"$f":"IF(ISBLANK(O35),0,HoursMinutesAndSeconds(seconds(O35)-seconds(O34)-seconds(O43)))","v":0},{"$f":"IF(ISBLANK(P35),0,HoursMinutesAndSeconds(seconds(P35)-seconds(P34)-seconds(P43)))","v":0},{"$f":"IF(ISBLANK(Q35),0,HoursMinutesAndSeconds(seconds(Q35)-seconds(Q34)-seconds(Q43)))","v":0},{"$f":"IF(ISBLANK(R35),0,HoursMinutesAndSeconds(seconds(R35)-seconds(R34)-seconds(R43)))","v":0},{"$f":"IF(ISBLANK(S35),0,HoursMinutesAndSeconds(seconds(S35)-seconds(S34)-seconds(S43)))","v":0},{"$f":"IF(ISBLANK(T35),0,HoursMinutesAndSeconds(seconds(T35)-seconds(T34)-seconds(T43)))","v":0},{"$f":"IF(ISBLANK(U35),0,HoursMinutesAndSeconds(seconds(U35)-seconds(U34)-seconds(U43)))","v":0},{"$f":"IF(ISBLANK(V35),0,HoursMinutesAndSeconds(seconds(V35)-seconds(V34)-seconds(V43)))","v":0},{"$f":"IF(ISBLANK(W35),0,HoursMinutesAndSeconds(seconds(W35)-seconds(W34)-seconds(W43)))","v":0},{"$f":"IF(ISBLANK(X35),0,HoursMinutesAndSeconds(seconds(X35)-seconds(X34)-seconds(X43)))","v":0},{"$f":"IF(ISBLANK(Y35),0,HoursMinutesAndSeconds(seconds(Y35)-seconds(Y34)-seconds(Y43)))","v":0},{"$f":"IF(ISBLANK(Z35),0,HoursMinutesAndSeconds(seconds(Z35)-seconds(Z34)-seconds(Z43)))","v":0},{"$f":"IF(ISBLANK(AA35),0,HoursMinutesAndSeconds(seconds(AA35)-seconds(AA34)-seconds(AA43)))","v":0},{"$f":"IF(ISBLANK(AB35),0,HoursMinutesAndSeconds(seconds(AB35)-seconds(AB34)-seconds(AB43)))","v":0},{"$f":"IF(ISBLANK(AC35),0,HoursMinutesAndSeconds(seconds(AC35)-seconds(AC34)-seconds(AC43)))","v":0},{"$f":"IF(ISBLANK(AD35),0,HoursMinutesAndSeconds(seconds(AD35)-seconds(AD34)-seconds(AD43)))","v":0},{"$f":"IF(ISBLANK(AE35),0,HoursMinutesAndSeconds(seconds(AE35)-seconds(AE34)-seconds(AE43)))","v":0},{"$f":"IF(ISBLANK(AF35),0,HoursMinutesAndSeconds(seconds(AF35)-seconds(AF34)-seconds(AF43)))","v":0},{"$f":"IF(ISBLANK(AG35),0,HoursMinutesAndSeconds(seconds(AG35)-seconds(AG34)-seconds(AG43)))","v":0},{"$f":"IF(ISBLANK(AH35),0,HoursMinutesAndSeconds(seconds(AH35)-seconds(AH34)-seconds(AH43)))","v":0},{"$f":"IF(ISBLANK(AI35),0,HoursMinutesAndSeconds(seconds(AI35)-seconds(AI34)-seconds(AI43)))","v":0},{"$f":"IF(ISBLANK(AJ35),0,HoursMinutesAndSeconds(seconds(AJ35)-seconds(AJ34)-seconds(AJ43)))","v":0},{"$f":"IF(ISBLANK(AK35),0,HoursMinutesAndSeconds(seconds(AK35)-seconds(AK34)-seconds(AK43)))","v":0},{"$f":"IF(ISBLANK(AL35),0,HoursMinutesAndSeconds(seconds(AL35)-seconds(AL34)-seconds(AL43)))","v":0},{"$f":"IF(ISBLANK(AM35),0,HoursMinutesAndSeconds(seconds(AM35)-seconds(AM34)-seconds(AM43)))","v":0},{"$f":"IF(ISBLANK(AN35),0,HoursMinutesAndSeconds(seconds(AN35)-seconds(AN34)-seconds(AN43)))","v":0},{"$f":"IF(ISBLANK(AO35),0,HoursMinutesAndSeconds(seconds(AO35)-seconds(AO34)-seconds(AO43)))","v":0},{"$f":"IF(ISBLANK(AP35),0,HoursMinutesAndSeconds(seconds(AP35)-seconds(AP34)-seconds(AP43)))","v":0},{"$f":"IF(ISBLANK(AQ35),0,HoursMinutesAndSeconds(seconds(AQ35)-seconds(AQ34)-seconds(AQ43)))","v":0},{"$f":"IF(ISBLANK(AR35),0,HoursMinutesAndSeconds(seconds(AR35)-seconds(AR34)-seconds(AR43)))","v":0},{"$f":"IF(ISBLANK(AS35),0,HoursMinutesAndSeconds(seconds(AS35)-seconds(AS34)-seconds(AS43)))","v":0},{"$f":"IF(ISBLANK(AT35),0,HoursMinutesAndSeconds(seconds(AT35)-seconds(AT34)-seconds(AT43)))","v":0},{"$f":"IF(ISBLANK(AU35),0,HoursMinutesAndSeconds(seconds(AU35)-seconds(AU34)-seconds(AU43)))","v":0},{"$f":"IF(ISBLANK(AV35),0,HoursMinutesAndSeconds(seconds(AV35)-seconds(AV34)-seconds(AV43)))","v":0},{"$f":"IF(ISBLANK(AW35),0,HoursMinutesAndSeconds(seconds(AW35)-seconds(AW34)-seconds(AW43)))","v":0},{"$f":"IF(ISBLANK(AX35),0,HoursMinutesAndSeconds(seconds(AX35)-seconds(AX34)-seconds(AX43)))","v":0},{"$f":"IF(ISBLANK(AY35),0,HoursMinutesAndSeconds(seconds(AY35)-seconds(AY34)-seconds(AY43)))","v":0},{"$f":"IF(ISBLANK(AZ35),0,HoursMinutesAndSeconds(seconds(AZ35)-seconds(AZ34)-seconds(AZ43)))","v":0},{"$f":"IF(ISBLANK(BA35),0,HoursMinutesAndSeconds(seconds(BA35)-seconds(BA34)-seconds(BA43)))","v":0},{"$f":"IF(ISBLANK(BB35),0,HoursMinutesAndSeconds(seconds(BB35)-seconds(BB34)-seconds(BB43)))","v":0},{"$f":"IF(ISBLANK(BC35),0,HoursMinutesAndSeconds(seconds(BC35)-seconds(BC34)-seconds(BC43)))","v":0},{"$f":"IF(ISBLANK(BD35),0,HoursMinutesAndSeconds(seconds(BD35)-seconds(BD34)-seconds(BD43)))","v":0},{"$f":"IF(ISBLANK(BE35),0,HoursMinutesAndSeconds(seconds(BE35)-seconds(BE34)-seconds(BE43)))","v":0},{"$f":"IF(ISBLANK(BF35),0,HoursMinutesAndSeconds(seconds(BF35)-seconds(BF34)-seconds(BF43)))","v":0},{"$f":"IF(ISBLANK(BG35),0,HoursMinutesAndSeconds(seconds(BG35)-seconds(BG34)-seconds(BG43)))","v":0},{"$f":"IF(ISBLANK(BH35),0,HoursMinutesAndSeconds(seconds(BH35)-seconds(BH34)-seconds(BH43)))","v":0},{"$f":"IF(ISBLANK(BI35),0,HoursMinutesAndSeconds(seconds(BI35)-seconds(BI34)-seconds(BI43)))","v":0},{"$f":"IF(ISBLANK(BJ35),0,HoursMinutesAndSeconds(seconds(BJ35)-seconds(BJ34)-seconds(BJ43)))","v":0}]
[null,"CP2",{"$f":"IF(ISBLANK(C36),0,HoursMinutesAndSeconds(seconds(C36)-seconds(C35)-seconds(C44)))","v":2231},{"$f":"IF(ISBLANK(D36),0,HoursMinutesAndSeconds(seconds(D36)-seconds(D35)-seconds(D44)))","v":0},{"$f":"IF(ISBLANK(E36),0,HoursMinutesAndSeconds(seconds(E36)-seconds(E35)-seconds(E44)))","v":2624},{"$f":"IF(ISBLANK(F36),0,HoursMinutesAndSeconds(seconds(F36)-seconds(F35)-seconds(F44)))","v":2534},{"$f":"IF(ISBLANK(G36),0,HoursMinutesAndSeconds(seconds(G36)-seconds(G35)-seconds(G44)))","v":3051},{"$f":"IF(ISBLANK(H36),0,HoursMinutesAndSeconds(seconds(H36)-seconds(H35)-seconds(H44)))","v":2513},{"$f":"IF(ISBLANK(I36),0,HoursMinutesAndSeconds(seconds(I36)-seconds(I35)-seconds(I44)))","v":2629},{"$f":"IF(ISBLANK(J36),0,HoursMinutesAndSeconds(seconds(J36)-seconds(J35)-seconds(J44)))","v":2529},{"$f":"IF(ISBLANK(K36),0,HoursMinutesAndSeconds(seconds(K36)-seconds(K35)-seconds(K44)))","v":2207},{"$f":"IF(ISBLANK(L36),0,HoursMinutesAndSeconds(seconds(L36)-seconds(L35)-seconds(L44)))","v":2732},{"$f":"IF(ISBLANK(M36),0,HoursMinutesAndSeconds(seconds(M36)-seconds(M35)-seconds(M44)))","v":0},{"$f":"IF(ISBLANK(N36),0,HoursMinutesAndSeconds(seconds(N36)-seconds(N35)-seconds(N44)))","v":0},{"$f":"IF(ISBLANK(O36),0,HoursMinutesAndSeconds(seconds(O36)-seconds(O35)-seconds(O44)))","v":0},{"$f":"IF(ISBLANK(P36),0,HoursMinutesAndSeconds(seconds(P36)-seconds(P35)-seconds(P44)))","v":0},{"$f":"IF(ISBLANK(Q36),0,HoursMinutesAndSeconds(seconds(Q36)-seconds(Q35)-seconds(Q44)))","v":0},{"$f":"IF(ISBLANK(R36),0,HoursMinutesAndSeconds(seconds(R36)-seconds(R35)-seconds(R44)))","v":0},{"$f":"IF(ISBLANK(S36),0,HoursMinutesAndSeconds(seconds(S36)-seconds(S35)-seconds(S44)))","v":0},{"$f":"IF(ISBLANK(T36),0,HoursMinutesAndSeconds(seconds(T36)-seconds(T35)-seconds(T44)))","v":0},{"$f":"IF(ISBLANK(U36),0,HoursMinutesAndSeconds(seconds(U36)-seconds(U35)-seconds(U44)))","v":0},{"$f":"IF(ISBLANK(V36),0,HoursMinutesAndSeconds(seconds(V36)-seconds(V35)-seconds(V44)))","v":0},{"$f":"IF(ISBLANK(W36),0,HoursMinutesAndSeconds(seconds(W36)-seconds(W35)-seconds(W44)))","v":0},{"$f":"IF(ISBLANK(X36),0,HoursMinutesAndSeconds(seconds(X36)-seconds(X35)-seconds(X44)))","v":0},{"$f":"IF(ISBLANK(Y36),0,HoursMinutesAndSeconds(seconds(Y36)-seconds(Y35)-seconds(Y44)))","v":0},{"$f":"IF(ISBLANK(Z36),0,HoursMinutesAndSeconds(seconds(Z36)-seconds(Z35)-seconds(Z44)))","v":0},{"$f":"IF(ISBLANK(AA36),0,HoursMinutesAndSeconds(seconds(AA36)-seconds(AA35)-seconds(AA44)))","v":0},{"$f":"IF(ISBLANK(AB36),0,HoursMinutesAndSeconds(seconds(AB36)-seconds(AB35)-seconds(AB44)))","v":0},{"$f":"IF(ISBLANK(AC36),0,HoursMinutesAndSeconds(seconds(AC36)-seconds(AC35)-seconds(AC44)))","v":0},{"$f":"IF(ISBLANK(AD36),0,HoursMinutesAndSeconds(seconds(AD36)-seconds(AD35)-seconds(AD44)))","v":0},{"$f":"IF(ISBLANK(AE36),0,HoursMinutesAndSeconds(seconds(AE36)-seconds(AE35)-seconds(AE44)))","v":0},{"$f":"IF(ISBLANK(AF36),0,HoursMinutesAndSeconds(seconds(AF36)-seconds(AF35)-seconds(AF44)))","v":0},{"$f":"IF(ISBLANK(AG36),0,HoursMinutesAndSeconds(seconds(AG36)-seconds(AG35)-seconds(AG44)))","v":0},{"$f":"IF(ISBLANK(AH36),0,HoursMinutesAndSeconds(seconds(AH36)-seconds(AH35)-seconds(AH44)))","v":0},{"$f":"IF(ISBLANK(AI36),0,HoursMinutesAndSeconds(seconds(AI36)-seconds(AI35)-seconds(AI44)))","v":0},{"$f":"IF(ISBLANK(AJ36),0,HoursMinutesAndSeconds(seconds(AJ36)-seconds(AJ35)-seconds(AJ44)))","v":0},{"$f":"IF(ISBLANK(AK36),0,HoursMinutesAndSeconds(seconds(AK36)-seconds(AK35)-seconds(AK44)))","v":0},{"$f":"IF(ISBLANK(AL36),0,HoursMinutesAndSeconds(seconds(AL36)-seconds(AL35)-seconds(AL44)))","v":0},{"$f":"IF(ISBLANK(AM36),0,HoursMinutesAndSeconds(seconds(AM36)-seconds(AM35)-seconds(AM44)))","v":0},{"$f":"IF(ISBLANK(AN36),0,HoursMinutesAndSeconds(seconds(AN36)-seconds(AN35)-seconds(AN44)))","v":0},{"$f":"IF(ISBLANK(AO36),0,HoursMinutesAndSeconds(seconds(AO36)-seconds(AO35)-seconds(AO44)))","v":0},{"$f":"IF(ISBLANK(AP36),0,HoursMinutesAndSeconds(seconds(AP36)-seconds(AP35)-seconds(AP44)))","v":0},{"$f":"IF(ISBLANK(AQ36),0,HoursMinutesAndSeconds(seconds(AQ36)-seconds(AQ35)-seconds(AQ44)))","v":0},{"$f":"IF(ISBLANK(AR36),0,HoursMinutesAndSeconds(seconds(AR36)-seconds(AR35)-seconds(AR44)))","v":0},{"$f":"IF(ISBLANK(AS36),0,HoursMinutesAndSeconds(seconds(AS36)-seconds(AS35)-seconds(AS44)))","v":0},{"$f":"IF(ISBLANK(AT36),0,HoursMinutesAndSeconds(seconds(AT36)-seconds(AT35)-seconds(AT44)))","v":0},{"$f":"IF(ISBLANK(AU36),0,HoursMinutesAndSeconds(seconds(AU36)-seconds(AU35)-seconds(AU44)))","v":0},{"$f":"IF(ISBLANK(AV36),0,HoursMinutesAndSeconds(seconds(AV36)-seconds(AV35)-seconds(AV44)))","v":0},{"$f":"IF(ISBLANK(AW36),0,HoursMinutesAndSeconds(seconds(AW36)-seconds(AW35)-seconds(AW44)))","v":0},{"$f":"IF(ISBLANK(AX36),0,HoursMinutesAndSeconds(seconds(AX36)-seconds(AX35)-seconds(AX44)))","v":0},{"$f":"IF(ISBLANK(AY36),0,HoursMinutesAndSeconds(seconds(AY36)-seconds(AY35)-seconds(AY44)))","v":0},{"$f":"IF(ISBLANK(AZ36),0,HoursMinutesAndSeconds(seconds(AZ36)-seconds(AZ35)-seconds(AZ44)))","v":0},{"$f":"IF(ISBLANK(BA36),0,HoursMinutesAndSeconds(seconds(BA36)-seconds(BA35)-seconds(BA44)))","v":0},{"$f":"IF(ISBLANK(BB36),0,HoursMinutesAndSeconds(seconds(BB36)-seconds(BB35)-seconds(BB44)))","v":0},{"$f":"IF(ISBLANK(BC36),0,HoursMinutesAndSeconds(seconds(BC36)-seconds(BC35)-seconds(BC44)))","v":0},{"$f":"IF(ISBLANK(BD36),0,HoursMinutesAndSeconds(seconds(BD36)-seconds(BD35)-seconds(BD44)))","v":0},{"$f":"IF(ISBLANK(BE36),0,HoursMinutesAndSeconds(seconds(BE36)-seconds(BE35)-seconds(BE44)))","v":0},{"$f":"IF(ISBLANK(BF36),0,HoursMinutesAndSeconds(seconds(BF36)-seconds(BF35)-seconds(BF44)))","v":0},{"$f":"IF(ISBLANK(BG36),0,HoursMinutesAndSeconds(seconds(BG36)-seconds(BG35)-seconds(BG44)))","v":0},{"$f":"IF(ISBLANK(BH36),0,HoursMinutesAndSeconds(seconds(BH36)-seconds(BH35)-seconds(BH44)))","v":0},{"$f":"IF(ISBLANK(BI36),0,HoursMinutesAndSeconds(seconds(BI36)-seconds(BI35)-seconds(BI44)))","v":0},{"$f":"IF(ISBLANK(BJ36),0,HoursMinutesAndSeconds(seconds(BJ36)-seconds(BJ35)-seconds(BJ44)))","v":0}]
[null,"CP3",{"$f":"IF(ISBLANK(C37),0,HoursMinutesAndSeconds(seconds(C37)-seconds(C36)-seconds(C45)))","v":2523},{"$f":"IF(ISBLANK(D37),0,HoursMinutesAndSeconds(seconds(D37)-seconds(D36)-seconds(D45)))","v":0},{"$f":"IF(ISBLANK(E37),0,HoursMinutesAndSeconds(seconds(E37)-seconds(E36)-seconds(E45)))","v":3400},{"$f":"IF(ISBLANK(F37),0,HoursMinutesAndSeconds(seconds(F37)-seconds(F36)-seconds(F45)))","v":2851},{"$f":"IF(ISBLANK(G37),0,HoursMinutesAndSeconds(seconds(G37)-seconds(G36)-seconds(G45)))","v":3537},{"$f":"IF(ISBLANK(H37),0,HoursMinutesAndSeconds(seconds(H37)-seconds(H36)-seconds(H45)))","v":2333},{"$f":"IF(ISBLANK(I37),0,HoursMinutesAndSeconds(seconds(I37)-seconds(I36)-seconds(I45)))","v":3022},{"$f":"IF(ISBLANK(J37),0,HoursMinutesAndSeconds(seconds(J37)-seconds(J36)-seconds(J45)))","v":2726},{"$f":"IF(ISBLANK(K37),0,HoursMinutesAndSeconds(seconds(K37)-seconds(K36)-seconds(K45)))","v":2443},{"$f":"IF(ISBLANK(L37),0,HoursMinutesAndSeconds(seconds(L37)-seconds(L36)-seconds(L45)))","v":2900},{"$f":"IF(ISBLANK(M37),0,HoursMinutesAndSeconds(seconds(M37)-seconds(M36)-seconds(M45)))","v":0},{"$f":"IF(ISBLANK(N37),0,HoursMinutesAndSeconds(seconds(N37)-seconds(N36)-seconds(N45)))","v":0},{"$f":"IF(ISBLANK(O37),0,HoursMinutesAndSeconds(seconds(O37)-seconds(O36)-seconds(O45)))","v":0},{"$f":"IF(ISBLANK(P37),0,HoursMinutesAndSeconds(seconds(P37)-seconds(P36)-seconds(P45)))","v":0},{"$f":"IF(ISBLANK(Q37),0,HoursMinutesAndSeconds(seconds(Q37)-seconds(Q36)-seconds(Q45)))","v":0},{"$f":"IF(ISBLANK(R37),0,HoursMinutesAndSeconds(seconds(R37)-seconds(R36)-seconds(R45)))","v":0},{"$f":"IF(ISBLANK(S37),0,HoursMinutesAndSeconds(seconds(S37)-seconds(S36)-seconds(S45)))","v":0},{"$f":"IF(ISBLANK(T37),0,HoursMinutesAndSeconds(seconds(T37)-seconds(T36)-seconds(T45)))","v":0},{"$f":"IF(ISBLANK(U37),0,HoursMinutesAndSeconds(seconds(U37)-seconds(U36)-seconds(U45)))","v":0},{"$f":"IF(ISBLANK(V37),0,HoursMinutesAndSeconds(seconds(V37)-seconds(V36)-seconds(V45)))","v":0},{"$f":"IF(ISBLANK(W37),0,HoursMinutesAndSeconds(seconds(W37)-seconds(W36)-seconds(W45)))","v":0},{"$f":"IF(ISBLANK(X37),0,HoursMinutesAndSeconds(seconds(X37)-seconds(X36)-seconds(X45)))","v":0},{"$f":"IF(ISBLANK(Y37),0,HoursMinutesAndSeconds(seconds(Y37)-seconds(Y36)-seconds(Y45)))","v":0},{"$f":"IF(ISBLANK(Z37),0,HoursMinutesAndSeconds(seconds(Z37)-seconds(Z36)-seconds(Z45)))","v":0},{"$f":"IF(ISBLANK(AA37),0,HoursMinutesAndSeconds(seconds(AA37)-seconds(AA36)-seconds(AA45)))","v":0},{"$f":"IF(ISBLANK(AB37),0,HoursMinutesAndSeconds(seconds(AB37)-seconds(AB36)-seconds(AB45)))","v":0},{"$f":"IF(ISBLANK(AC37),0,HoursMinutesAndSeconds(seconds(AC37)-seconds(AC36)-seconds(AC45)))","v":0},{"$f":"IF(ISBLANK(AD37),0,HoursMinutesAndSeconds(seconds(AD37)-seconds(AD36)-seconds(AD45)))","v":0},{"$f":"IF(ISBLANK(AE37),0,HoursMinutesAndSeconds(seconds(AE37)-seconds(AE36)-seconds(AE45)))","v":0},{"$f":"IF(ISBLANK(AF37),0,HoursMinutesAndSeconds(seconds(AF37)-seconds(AF36)-seconds(AF45)))","v":0},{"$f":"IF(ISBLANK(AG37),0,HoursMinutesAndSeconds(seconds(AG37)-seconds(AG36)-seconds(AG45)))","v":0},{"$f":"IF(ISBLANK(AH37),0,HoursMinutesAndSeconds(seconds(AH37)-seconds(AH36)-seconds(AH45)))","v":0},{"$f":"IF(ISBLANK(AI37),0,HoursMinutesAndSeconds(seconds(AI37)-seconds(AI36)-seconds(AI45)))","v":0},{"$f":"IF(ISBLANK(AJ37),0,HoursMinutesAndSeconds(seconds(AJ37)-seconds(AJ36)-seconds(AJ45)))","v":0},{"$f":"IF(ISBLANK(AK37),0,HoursMinutesAndSeconds(seconds(AK37)-seconds(AK36)-seconds(AK45)))","v":0},{"$f":"IF(ISBLANK(AL37),0,HoursMinutesAndSeconds(seconds(AL37)-seconds(AL36)-seconds(AL45)))","v":0},{"$f":"IF(ISBLANK(AM37),0,HoursMinutesAndSeconds(seconds(AM37)-seconds(AM36)-seconds(AM45)))","v":0},{"$f":"IF(ISBLANK(AN37),0,HoursMinutesAndSeconds(seconds(AN37)-seconds(AN36)-seconds(AN45)))","v":0},{"$f":"IF(ISBLANK(AO37),0,HoursMinutesAndSeconds(seconds(AO37)-seconds(AO36)-seconds(AO45)))","v":0},{"$f":"IF(ISBLANK(AP37),0,HoursMinutesAndSeconds(seconds(AP37)-seconds(AP36)-seconds(AP45)))","v":0},{"$f":"IF(ISBLANK(AQ37),0,HoursMinutesAndSeconds(seconds(AQ37)-seconds(AQ36)-seconds(AQ45)))","v":0},{"$f":"IF(ISBLANK(AR37),0,HoursMinutesAndSeconds(seconds(AR37)-seconds(AR36)-seconds(AR45)))","v":0},{"$f":"IF(ISBLANK(AS37),0,HoursMinutesAndSeconds(seconds(AS37)-seconds(AS36)-seconds(AS45)))","v":0},{"$f":"IF(ISBLANK(AT37),0,HoursMinutesAndSeconds(seconds(AT37)-seconds(AT36)-seconds(AT45)))","v":0},{"$f":"IF(ISBLANK(AU37),0,HoursMinutesAndSeconds(seconds(AU37)-seconds(AU36)-seconds(AU45)))","v":0},{"$f":"IF(ISBLANK(AV37),0,HoursMinutesAndSeconds(seconds(AV37)-seconds(AV36)-seconds(AV45)))","v":0},{"$f":"IF(ISBLANK(AW37),0,HoursMinutesAndSeconds(seconds(AW37)-seconds(AW36)-seconds(AW45)))","v":0},{"$f":"IF(ISBLANK(AX37),0,HoursMinutesAndSeconds(seconds(AX37)-seconds(AX36)-seconds(AX45)))","v":0},{"$f":"IF(ISBLANK(AY37),0,HoursMinutesAndSeconds(seconds(AY37)-seconds(AY36)-seconds(AY45)))","v":0},{"$f":"IF(ISBLANK(AZ37),0,HoursMinutesAndSeconds(seconds(AZ37)-seconds(AZ36)-seconds(AZ45)))","v":0},{"$f":"IF(ISBLANK(BA37),0,HoursMinutesAndSeconds(seconds(BA37)-seconds(BA36)-seconds(BA45)))","v":0},{"$f":"IF(ISBLANK(BB37),0,HoursMinutesAndSeconds(seconds(BB37)-seconds(BB36)-seconds(BB45)))","v":0},{"$f":"IF(ISBLANK(BC37),0,HoursMinutesAndSeconds(seconds(BC37)-seconds(BC36)-seconds(BC45)))","v":0},{"$f":"IF(ISBLANK(BD37),0,HoursMinutesAndSeconds(seconds(BD37)-seconds(BD36)-seconds(BD45)))","v":0},{"$f":"IF(ISBLANK(BE37),0,HoursMinutesAndSeconds(seconds(BE37)-seconds(BE36)-seconds(BE45)))","v":0},{"$f":"IF(ISBLANK(BF37),0,HoursMinutesAndSeconds(seconds(BF37)-seconds(BF36)-seconds(BF45)))","v":0},{"$f":"IF(ISBLANK(BG37),0,HoursMinutesAndSeconds(seconds(BG37)-seconds(BG36)-seconds(BG45)))","v":0},{"$f":"IF(ISBLANK(BH37),0,HoursMinutesAndSeconds(seconds(BH37)-seconds(BH36)-seconds(BH45)))","v":0},{"$f":"IF(ISBLANK(BI37),0,HoursMinutesAndSeconds(seconds(BI37)-seconds(BI36)-seconds(BI45)))","v":0},{"$f":"IF(ISBLANK(BJ37),0,HoursMinutesAndSeconds(seconds(BJ37)-seconds(BJ36)-seconds(BJ45)))","v":0}]
[null,"CP4",{"$f":"IF(ISBLANK(C38),0,HoursMinutesAndSeconds(seconds(C38)-seconds(C37)-seconds(C46)))","v":2020},{"$f":"IF(ISBLANK(D38),0,HoursMinutesAndSeconds(seconds(D38)-seconds(D37)-seconds(D46)))","v":0},{"$f":"IF(ISBLANK(E38),0,HoursMinutesAndSeconds(seconds(E38)-seconds(E37)-seconds(E46)))","v":2422},{"$f":"IF(ISBLANK(F38),0,HoursMinutesAndSeconds(seconds(F38)-seconds(F37)-seconds(F46)))","v":2235},{"$f":"IF(ISBLANK(G38),0,HoursMinutesAndSeconds(seconds(G38)-seconds(G37)-seconds(G46)))","v":2340},{"$f":"IF(ISBLANK(H38),0,HoursMinutesAndSeconds(seconds(H38)-seconds(H37)-seconds(H46)))","v":2141},{"$f":"IF(ISBLANK(I38),0,HoursMinutesAndSeconds(seconds(I38)-seconds(I37)-seconds(I46)))","v":2235},{"$f":"IF(ISBLANK(J38),0,HoursMinutesAndSeconds(seconds(J38)-seconds(J37)-seconds(J46)))","v":2240},{"$f":"IF(ISBLANK(K38),0,HoursMinutesAndSeconds(seconds(K38)-seconds(K37)-seconds(K46)))","v":2042},{"$f":"IF(ISBLANK(L38),0,HoursMinutesAndSeconds(seconds(L38)-seconds(L37)-seconds(L46)))","v":2205},{"$f":"IF(ISBLANK(M38),0,HoursMinutesAndSeconds(seconds(M38)-seconds(M37)-seconds(M46)))","v":0},{"$f":"IF(ISBLANK(N38),0,HoursMinutesAndSeconds(seconds(N38)-seconds(N37)-seconds(N46)))","v":0},{"$f":"IF(ISBLANK(O38),0,HoursMinutesAndSeconds(seconds(O38)-seconds(O37)-seconds(O46)))","v":0},{"$f":"IF(ISBLANK(P38),0,HoursMinutesAndSeconds(seconds(P38)-seconds(P37)-seconds(P46)))","v":0},{"$f":"IF(ISBLANK(Q38),0,HoursMinutesAndSeconds(seconds(Q38)-seconds(Q37)-seconds(Q46)))","v":0},{"$f":"IF(ISBLANK(R38),0,HoursMinutesAndSeconds(seconds(R38)-seconds(R37)-seconds(R46)))","v":0},{"$f":"IF(ISBLANK(S38),0,HoursMinutesAndSeconds(seconds(S38)-seconds(S37)-seconds(S46)))","v":0},{"$f":"IF(ISBLANK(T38),0,HoursMinutesAndSeconds(seconds(T38)-seconds(T37)-seconds(T46)))","v":0},{"$f":"IF(ISBLANK(U38),0,HoursMinutesAndSeconds(seconds(U38)-seconds(U37)-seconds(U46)))","v":0},{"$f":"IF(ISBLANK(V38),0,HoursMinutesAndSeconds(seconds(V38)-seconds(V37)-seconds(V46)))","v":0},{"$f":"IF(ISBLANK(W38),0,HoursMinutesAndSeconds(seconds(W38)-seconds(W37)-seconds(W46)))","v":0},{"$f":"IF(ISBLANK(X38),0,HoursMinutesAndSeconds(seconds(X38)-seconds(X37)-seconds(X46)))","v":0},{"$f":"IF(ISBLANK(Y38),0,HoursMinutesAndSeconds(seconds(Y38)-seconds(Y37)-seconds(Y46)))","v":0},{"$f":"IF(ISBLANK(Z38),0,HoursMinutesAndSeconds(seconds(Z38)-seconds(Z37)-seconds(Z46)))","v":0},{"$f":"IF(ISBLANK(AA38),0,HoursMinutesAndSeconds(seconds(AA38)-seconds(AA37)-seconds(AA46)))","v":0},{"$f":"IF(ISBLANK(AB38),0,HoursMinutesAndSeconds(seconds(AB38)-seconds(AB37)-seconds(AB46)))","v":0},{"$f":"IF(ISBLANK(AC38),0,HoursMinutesAndSeconds(seconds(AC38)-seconds(AC37)-seconds(AC46)))","v":0},{"$f":"IF(ISBLANK(AD38),0,HoursMinutesAndSeconds(seconds(AD38)-seconds(AD37)-seconds(AD46)))","v":0},{"$f":"IF(ISBLANK(AE38),0,HoursMinutesAndSeconds(seconds(AE38)-seconds(AE37)-seconds(AE46)))","v":0},{"$f":"IF(ISBLANK(AF38),0,HoursMinutesAndSeconds(seconds(AF38)-seconds(AF37)-seconds(AF46)))","v":0},{"$f":"IF(ISBLANK(AG38),0,HoursMinutesAndSeconds(seconds(AG38)-seconds(AG37)-seconds(AG46)))","v":0},{"$f":"IF(ISBLANK(AH38),0,HoursMinutesAndSeconds(seconds(AH38)-seconds(AH37)-seconds(AH46)))","v":0},{"$f":"IF(ISBLANK(AI38),0,HoursMinutesAndSeconds(seconds(AI38)-seconds(AI37)-seconds(AI46)))","v":0},{"$f":"IF(ISBLANK(AJ38),0,HoursMinutesAndSeconds(seconds(AJ38)-seconds(AJ37)-seconds(AJ46)))","v":0},{"$f":"IF(ISBLANK(AK38),0,HoursMinutesAndSeconds(seconds(AK38)-seconds(AK37)-seconds(AK46)))","v":0},{"$f":"IF(ISBLANK(AL38),0,HoursMinutesAndSeconds(seconds(AL38)-seconds(AL37)-seconds(AL46)))","v":0},{"$f":"IF(ISBLANK(AM38),0,HoursMinutesAndSeconds(seconds(AM38)-seconds(AM37)-seconds(AM46)))","v":0},{"$f":"IF(ISBLANK(AN38),0,HoursMinutesAndSeconds(seconds(AN38)-seconds(AN37)-seconds(AN46)))","v":0},{"$f":"IF(ISBLANK(AO38),0,HoursMinutesAndSeconds(seconds(AO38)-seconds(AO37)-seconds(AO46)))","v":0},{"$f":"IF(ISBLANK(AP38),0,HoursMinutesAndSeconds(seconds(AP38)-seconds(AP37)-seconds(AP46)))","v":0},{"$f":"IF(ISBLANK(AQ38),0,HoursMinutesAndSeconds(seconds(AQ38)-seconds(AQ37)-seconds(AQ46)))","v":0},{"$f":"IF(ISBLANK(AR38),0,HoursMinutesAndSeconds(seconds(AR38)-seconds(AR37)-seconds(AR46)))","v":0},{"$f":"IF(ISBLANK(AS38),0,HoursMinutesAndSeconds(seconds(AS38)-seconds(AS37)-seconds(AS46)))","v":0},{"$f":"IF(ISBLANK(AT38),0,HoursMinutesAndSeconds(seconds(AT38)-seconds(AT37)-seconds(AT46)))","v":0},{"$f":"IF(ISBLANK(AU38),0,HoursMinutesAndSeconds(seconds(AU38)-seconds(AU37)-seconds(AU46)))","v":0},{"$f":"IF(ISBLANK(AV38),0,HoursMinutesAndSeconds(seconds(AV38)-seconds(AV37)-seconds(AV46)))","v":0},{"$f":"IF(ISBLANK(AW38),0,HoursMinutesAndSeconds(seconds(AW38)-seconds(AW37)-seconds(AW46)))","v":0},{"$f":"IF(ISBLANK(AX38),0,HoursMinutesAndSeconds(seconds(AX38)-seconds(AX37)-seconds(AX46)))","v":0},{"$f":"IF(ISBLANK(AY38),0,HoursMinutesAndSeconds(seconds(AY38)-seconds(AY37)-seconds(AY46)))","v":0},{"$f":"IF(ISBLANK(AZ38),0,HoursMinutesAndSeconds(seconds(AZ38)-seconds(AZ37)-seconds(AZ46)))","v":0},{"$f":"IF(ISBLANK(BA38),0,HoursMinutesAndSeconds(seconds(BA38)-seconds(BA37)-seconds(BA46)))","v":0},{"$f":"IF(ISBLANK(BB38),0,HoursMinutesAndSeconds(seconds(BB38)-seconds(BB37)-seconds(BB46)))","v":0},{"$f":"IF(ISBLANK(BC38),0,HoursMinutesAndSeconds(seconds(BC38)-seconds(BC37)-seconds(BC46)))","v":0},{"$f":"IF(ISBLANK(BD38),0,HoursMinutesAndSeconds(seconds(BD38)-seconds(BD37)-seconds(BD46)))","v":0},{"$f":"IF(ISBLANK(BE38),0,HoursMinutesAndSeconds(seconds(BE38)-seconds(BE37)-seconds(BE46)))","v":0},{"$f":"IF(ISBLANK(BF38),0,HoursMinutesAndSeconds(seconds(BF38)-seconds(BF37)-seconds(BF46)))","v":0},{"$f":"IF(ISBLANK(BG38),0,HoursMinutesAndSeconds(seconds(BG38)-seconds(BG37)-seconds(BG46)))","v":0},{"$f":"IF(ISBLANK(BH38),0,HoursMinutesAndSeconds(seconds(BH38)-seconds(BH37)-seconds(BH46)))","v":0},{"$f":"IF(ISBLANK(BI38),0,HoursMinutesAndSeconds(seconds(BI38)-seconds(BI37)-seconds(BI46)))","v":0},{"$f":"IF(ISBLANK(BJ38),0,HoursMinutesAndSeconds(seconds(BJ38)-seconds(BJ37)-seconds(BJ46)))","v":0}]
[null,"CP5",{"$f":"IF(ISBLANK(C39),0,HoursMinutesAndSeconds(seconds(C39)-seconds(C38)-seconds(C47)))","v":0},{"$f":"IF(ISBLANK(D39),0,HoursMinutesAndSeconds(seconds(D39)-seconds(D38)-seconds(D47)))","v":0},{"$f":"IF(ISBLANK(E39),0,HoursMinutesAndSeconds(seconds(E39)-seconds(E38)-seconds(E47)))","v":0},{"$f":"IF(ISBLANK(F39),0,HoursMinutesAndSeconds(seconds(F39)-seconds(F38)-seconds(F47)))","v":0},{"$f":"IF(ISBLANK(G39),0,HoursMinutesAndSeconds(seconds(G39)-seconds(G38)-seconds(G47)))","v":0},{"$f":"IF(ISBLANK(H39),0,HoursMinutesAndSeconds(seconds(H39)-seconds(H38)-seconds(H47)))","v":0},{"$f":"IF(ISBLANK(I39),0,HoursMinutesAndSeconds(seconds(I39)-seconds(I38)-seconds(I47)))","v":0},{"$f":"IF(ISBLANK(J39),0,HoursMinutesAndSeconds(seconds(J39)-seconds(J38)-seconds(J47)))","v":0},{"$f":"IF(ISBLANK(K39),0,HoursMinutesAndSeconds(seconds(K39)-seconds(K38)-seconds(K47)))","v":0},{"$f":"IF(ISBLANK(L39),0,HoursMinutesAndSeconds(seconds(L39)-seconds(L38)-seconds(L47)))","v":0},{"$f":"IF(ISBLANK(M39),0,HoursMinutesAndSeconds(seconds(M39)-seconds(M38)-seconds(M47)))","v":0},{"$f":"IF(ISBLANK(N39),0,HoursMinutesAndSeconds(seconds(N39)-seconds(N38)-seconds(N47)))","v":0},{"$f":"IF(ISBLANK(O39),0,HoursMinutesAndSeconds(seconds(O39)-seconds(O38)-seconds(O47)))","v":0},{"$f":"IF(ISBLANK(P39),0,HoursMinutesAndSeconds(seconds(P39)-seconds(P38)-seconds(P47)))","v":0},{"$f":"IF(ISBLANK(Q39),0,HoursMinutesAndSeconds(seconds(Q39)-seconds(Q38)-seconds(Q47)))","v":0},{"$f":"IF(ISBLANK(R39),0,HoursMinutesAndSeconds(seconds(R39)-seconds(R38)-seconds(R47)))","v":0},{"$f":"IF(ISBLANK(S39),0,HoursMinutesAndSeconds(seconds(S39)-seconds(S38)-seconds(S47)))","v":0},{"$f":"IF(ISBLANK(T39),0,HoursMinutesAndSeconds(seconds(T39)-seconds(T38)-seconds(T47)))","v":0},{"$f":"IF(ISBLANK(U39),0,HoursMinutesAndSeconds(seconds(U39)-seconds(U38)-seconds(U47)))","v":0},{"$f":"IF(ISBLANK(V39),0,HoursMinutesAndSeconds(seconds(V39)-seconds(V38)-seconds(V47)))","v":0},{"$f":"IF(ISBLANK(W39),0,HoursMinutesAndSeconds(seconds(W39)-seconds(W38)-seconds(W47)))","v":0},{"$f":"IF(ISBLANK(X39),0,HoursMinutesAndSeconds(seconds(X39)-seconds(X38)-seconds(X47)))","v":0},{"$f":"IF(ISBLANK(Y39),0,HoursMinutesAndSeconds(seconds(Y39)-seconds(Y38)-seconds(Y47)))","v":0},{"$f":"IF(ISBLANK(Z39),0,HoursMinutesAndSeconds(seconds(Z39)-seconds(Z38)-seconds(Z47)))","v":0},{"$f":"IF(ISBLANK(AA39),0,HoursMinutesAndSeconds(seconds(AA39)-seconds(AA38)-seconds(AA47)))","v":0},{"$f":"IF(ISBLANK(AB39),0,HoursMinutesAndSeconds(seconds(AB39)-seconds(AB38)-seconds(AB47)))","v":0},{"$f":"IF(ISBLANK(AC39),0,HoursMinutesAndSeconds(seconds(AC39)-seconds(AC38)-seconds(AC47)))","v":0},{"$f":"IF(ISBLANK(AD39),0,HoursMinutesAndSeconds(seconds(AD39)-seconds(AD38)-seconds(AD47)))","v":0},{"$f":"IF(ISBLANK(AE39),0,HoursMinutesAndSeconds(seconds(AE39)-seconds(AE38)-seconds(AE47)))","v":0},{"$f":"IF(ISBLANK(AF39),0,HoursMinutesAndSeconds(seconds(AF39)-seconds(AF38)-seconds(AF47)))","v":0},{"$f":"IF(ISBLANK(AG39),0,HoursMinutesAndSeconds(seconds(AG39)-seconds(AG38)-seconds(AG47)))","v":0},{"$f":"IF(ISBLANK(AH39),0,HoursMinutesAndSeconds(seconds(AH39)-seconds(AH38)-seconds(AH47)))","v":0},{"$f":"IF(ISBLANK(AI39),0,HoursMinutesAndSeconds(seconds(AI39)-seconds(AI38)-seconds(AI47)))","v":0},{"$f":"IF(ISBLANK(AJ39),0,HoursMinutesAndSeconds(seconds(AJ39)-seconds(AJ38)-seconds(AJ47)))","v":0},{"$f":"IF(ISBLANK(AK39),0,HoursMinutesAndSeconds(seconds(AK39)-seconds(AK38)-seconds(AK47)))","v":0},{"$f":"IF(ISBLANK(AL39),0,HoursMinutesAndSeconds(seconds(AL39)-seconds(AL38)-seconds(AL47)))","v":0},{"$f":"IF(ISBLANK(AM39),0,HoursMinutesAndSeconds(seconds(AM39)-seconds(AM38)-seconds(AM47)))","v":0},{"$f":"IF(ISBLANK(AN39),0,HoursMinutesAndSeconds(seconds(AN39)-seconds(AN38)-seconds(AN47)))","v":0},{"$f":"IF(ISBLANK(AO39),0,HoursMinutesAndSeconds(seconds(AO39)-seconds(AO38)-seconds(AO47)))","v":0},{"$f":"IF(ISBLANK(AP39),0,HoursMinutesAndSeconds(seconds(AP39)-seconds(AP38)-seconds(AP47)))","v":0},{"$f":"IF(ISBLANK(AQ39),0,HoursMinutesAndSeconds(seconds(AQ39)-seconds(AQ38)-seconds(AQ47)))","v":0},{"$f":"IF(ISBLANK(AR39),0,HoursMinutesAndSeconds(seconds(AR39)-seconds(AR38)-seconds(AR47)))","v":0},{"$f":"IF(ISBLANK(AS39),0,HoursMinutesAndSeconds(seconds(AS39)-seconds(AS38)-seconds(AS47)))","v":0},{"$f":"IF(ISBLANK(AT39),0,HoursMinutesAndSeconds(seconds(AT39)-seconds(AT38)-seconds(AT47)))","v":0},{"$f":"IF(ISBLANK(AU39),0,HoursMinutesAndSeconds(seconds(AU39)-seconds(AU38)-seconds(AU47)))","v":0},{"$f":"IF(ISBLANK(AV39),0,HoursMinutesAndSeconds(seconds(AV39)-seconds(AV38)-seconds(AV47)))","v":0},{"$f":"IF(ISBLANK(AW39),0,HoursMinutesAndSeconds(seconds(AW39)-seconds(AW38)-seconds(AW47)))","v":0},{"$f":"IF(ISBLANK(AX39),0,HoursMinutesAndSeconds(seconds(AX39)-seconds(AX38)-seconds(AX47)))","v":0},{"$f":"IF(ISBLANK(AY39),0,HoursMinutesAndSeconds(seconds(AY39)-seconds(AY38)-seconds(AY47)))","v":0},{"$f":"IF(ISBLANK(AZ39),0,HoursMinutesAndSeconds(seconds(AZ39)-seconds(AZ38)-seconds(AZ47)))","v":0},{"$f":"IF(ISBLANK(BA39),0,HoursMinutesAndSeconds(seconds(BA39)-seconds(BA38)-seconds(BA47)))","v":0},{"$f":"IF(ISBLANK(BB39),0,HoursMinutesAndSeconds(seconds(BB39)-seconds(BB38)-seconds(BB47)))","v":0},{"$f":"IF(ISBLANK(BC39),0,HoursMinutesAndSeconds(seconds(BC39)-seconds(BC38)-seconds(BC47)))","v":0},{"$f":"IF(ISBLANK(BD39),0,HoursMinutesAndSeconds(seconds(BD39)-seconds(BD38)-seconds(BD47)))","v":0},{"$f":"IF(ISBLANK(BE39),0,HoursMinutesAndSeconds(seconds(BE39)-seconds(BE38)-seconds(BE47)))","v":0},{"$f":"IF(ISBLANK(BF39),0,HoursMinutesAndSeconds(seconds(BF39)-seconds(BF38)-seconds(BF47)))","v":0},{"$f":"IF(ISBLANK(BG39),0,HoursMinutesAndSeconds(seconds(BG39)-seconds(BG38)-seconds(BG47)))","v":0},{"$f":"IF(ISBLANK(BH39),0,HoursMinutesAndSeconds(seconds(BH39)-seconds(BH38)-seconds(BH47)))","v":0},{"$f":"IF(ISBLANK(BI39),0,HoursMinutesAndSeconds(seconds(BI39)-seconds(BI38)-seconds(BI47)))","v":0},{"$f":"IF(ISBLANK(BJ39),0,HoursMinutesAndSeconds(seconds(BJ39)-seconds(BJ38)-seconds(BJ47)))","v":0}]
[null,"CP6",{"$f":"IF(ISBLANK(C40),0,HoursMinutesAndSeconds(seconds(C40)-seconds(C39)-seconds(C48)))","v":0},{"$f":"IF(ISBLANK(D40),0,HoursMinutesAndSeconds(seconds(D40)-seconds(D39)-seconds(D48)))","v":0},{"$f":"IF(ISBLANK(E40),0,HoursMinutesAndSeconds(seconds(E40)-seconds(E39)-seconds(E48)))","v":0},{"$f":"IF(ISBLANK(F40),0,HoursMinutesAndSeconds(seconds(F40)-seconds(F39)-seconds(F48)))","v":0},{"$f":"IF(ISBLANK(G40),0,HoursMinutesAndSeconds(seconds(G40)-seconds(G39)-seconds(G48)))","v":0},{"$f":"IF(ISBLANK(H40),0,HoursMinutesAndSeconds(seconds(H40)-seconds(H39)-seconds(H48)))","v":0},{"$f":"IF(ISBLANK(I40),0,HoursMinutesAndSeconds(seconds(I40)-seconds(I39)-seconds(I48)))","v":0},{"$f":"IF(ISBLANK(J40),0,HoursMinutesAndSeconds(seconds(J40)-seconds(J39)-seconds(J48)))","v":0},{"$f":"IF(ISBLANK(K40),0,HoursMinutesAndSeconds(seconds(K40)-seconds(K39)-seconds(K48)))","v":0},{"$f":"IF(ISBLANK(L40),0,HoursMinutesAndSeconds(seconds(L40)-seconds(L39)-seconds(L48)))","v":0},{"$f":"IF(ISBLANK(M40),0,HoursMinutesAndSeconds(seconds(M40)-seconds(M39)-seconds(M48)))","v":0},{"$f":"IF(ISBLANK(N40),0,HoursMinutesAndSeconds(seconds(N40)-seconds(N39)-seconds(N48)))","v":0},{"$f":"IF(ISBLANK(O40),0,HoursMinutesAndSeconds(seconds(O40)-seconds(O39)-seconds(O48)))","v":0},{"$f":"IF(ISBLANK(P40),0,HoursMinutesAndSeconds(seconds(P40)-seconds(P39)-seconds(P48)))","v":0},{"$f":"IF(ISBLANK(Q40),0,HoursMinutesAndSeconds(seconds(Q40)-seconds(Q39)-seconds(Q48)))","v":0},{"$f":"IF(ISBLANK(R40),0,HoursMinutesAndSeconds(seconds(R40)-seconds(R39)-seconds(R48)))","v":0},{"$f":"IF(ISBLANK(S40),0,HoursMinutesAndSeconds(seconds(S40)-seconds(S39)-seconds(S48)))","v":0},{"$f":"IF(ISBLANK(T40),0,HoursMinutesAndSeconds(seconds(T40)-seconds(T39)-seconds(T48)))","v":0},{"$f":"IF(ISBLANK(U40),0,HoursMinutesAndSeconds(seconds(U40)-seconds(U39)-seconds(U48)))","v":0},{"$f":"IF(ISBLANK(V40),0,HoursMinutesAndSeconds(seconds(V40)-seconds(V39)-seconds(V48)))","v":0},{"$f":"IF(ISBLANK(W40),0,HoursMinutesAndSeconds(seconds(W40)-seconds(W39)-seconds(W48)))","v":0},{"$f":"IF(ISBLANK(X40),0,HoursMinutesAndSeconds(seconds(X40)-seconds(X39)-seconds(X48)))","v":0},{"$f":"IF(ISBLANK(Y40),0,HoursMinutesAndSeconds(seconds(Y40)-seconds(Y39)-seconds(Y48)))","v":0},{"$f":"IF(ISBLANK(Z40),0,HoursMinutesAndSeconds(seconds(Z40)-seconds(Z39)-seconds(Z48)))","v":0},{"$f":"IF(ISBLANK(AA40),0,HoursMinutesAndSeconds(seconds(AA40)-seconds(AA39)-seconds(AA48)))","v":0},{"$f":"IF(ISBLANK(AB40),0,HoursMinutesAndSeconds(seconds(AB40)-seconds(AB39)-seconds(AB48)))","v":0},{"$f":"IF(ISBLANK(AC40),0,HoursMinutesAndSeconds(seconds(AC40)-seconds(AC39)-seconds(AC48)))","v":0},{"$f":"IF(ISBLANK(AD40),0,HoursMinutesAndSeconds(seconds(AD40)-seconds(AD39)-seconds(AD48)))","v":0},{"$f":"IF(ISBLANK(AE40),0,HoursMinutesAndSeconds(seconds(AE40)-seconds(AE39)-seconds(AE48)))","v":0},{"$f":"IF(ISBLANK(AF40),0,HoursMinutesAndSeconds(seconds(AF40)-seconds(AF39)-seconds(AF48)))","v":0},{"$f":"IF(ISBLANK(AG40),0,HoursMinutesAndSeconds(seconds(AG40)-seconds(AG39)-seconds(AG48)))","v":0},{"$f":"IF(ISBLANK(AH40),0,HoursMinutesAndSeconds(seconds(AH40)-seconds(AH39)-seconds(AH48)))","v":0},{"$f":"IF(ISBLANK(AI40),0,HoursMinutesAndSeconds(seconds(AI40)-seconds(AI39)-seconds(AI48)))","v":0},{"$f":"IF(ISBLANK(AJ40),0,HoursMinutesAndSeconds(seconds(AJ40)-seconds(AJ39)-seconds(AJ48)))","v":0},{"$f":"IF(ISBLANK(AK40),0,HoursMinutesAndSeconds(seconds(AK40)-seconds(AK39)-seconds(AK48)))","v":0},{"$f":"IF(ISBLANK(AL40),0,HoursMinutesAndSeconds(seconds(AL40)-seconds(AL39)-seconds(AL48)))","v":0},{"$f":"IF(ISBLANK(AM40),0,HoursMinutesAndSeconds(seconds(AM40)-seconds(AM39)-seconds(AM48)))","v":0},{"$f":"IF(ISBLANK(AN40),0,HoursMinutesAndSeconds(seconds(AN40)-seconds(AN39)-seconds(AN48)))","v":0},{"$f":"IF(ISBLANK(AO40),0,HoursMinutesAndSeconds(seconds(AO40)-seconds(AO39)-seconds(AO48)))","v":0},{"$f":"IF(ISBLANK(AP40),0,HoursMinutesAndSeconds(seconds(AP40)-seconds(AP39)-seconds(AP48)))","v":0},{"$f":"IF(ISBLANK(AQ40),0,HoursMinutesAndSeconds(seconds(AQ40)-seconds(AQ39)-seconds(AQ48)))","v":0},{"$f":"IF(ISBLANK(AR40),0,HoursMinutesAndSeconds(seconds(AR40)-seconds(AR39)-seconds(AR48)))","v":0},{"$f":"IF(ISBLANK(AS40),0,HoursMinutesAndSeconds(seconds(AS40)-seconds(AS39)-seconds(AS48)))","v":0},{"$f":"IF(ISBLANK(AT40),0,HoursMinutesAndSeconds(seconds(AT40)-seconds(AT39)-seconds(AT48)))","v":0},{"$f":"IF(ISBLANK(AU40),0,HoursMinutesAndSeconds(seconds(AU40)-seconds(AU39)-seconds(AU48)))","v":0},{"$f":"IF(ISBLANK(AV40),0,HoursMinutesAndSeconds(seconds(AV40)-seconds(AV39)-seconds(AV48)))","v":0},{"$f":"IF(ISBLANK(AW40),0,HoursMinutesAndSeconds(seconds(AW40)-seconds(AW39)-seconds(AW48)))","v":0},{"$f":"IF(ISBLANK(AX40),0,HoursMinutesAndSeconds(seconds(AX40)-seconds(AX39)-seconds(AX48)))","v":0},{"$f":"IF(ISBLANK(AY40),0,HoursMinutesAndSeconds(seconds(AY40)-seconds(AY39)-seconds(AY48)))","v":0},{"$f":"IF(ISBLANK(AZ40),0,HoursMinutesAndSeconds(seconds(AZ40)-seconds(AZ39)-seconds(AZ48)))","v":0},{"$f":"IF(ISBLANK(BA40),0,HoursMinutesAndSeconds(seconds(BA40)-seconds(BA39)-seconds(BA48)))","v":0},{"$f":"IF(ISBLANK(BB40),0,HoursMinutesAndSeconds(seconds(BB40)-seconds(BB39)-seconds(BB48)))","v":0},{"$f":"IF(ISBLANK(BC40),0,HoursMinutesAndSeconds(seconds(BC40)-seconds(BC39)-seconds(BC48)))","v":0},{"$f":"IF(ISBLANK(BD40),0,HoursMinutesAndSeconds(seconds(BD40)-seconds(BD39)-seconds(BD48)))","v":0},{"$f":"IF(ISBLANK(BE40),0,HoursMinutesAndSeconds(seconds(BE40)-seconds(BE39)-seconds(BE48)))","v":0},{"$f":"IF(ISBLANK(BF40),0,HoursMinutesAndSeconds(seconds(BF40)-seconds(BF39)-seconds(BF48)))","v":0},{"$f":"IF(ISBLANK(BG40),0,HoursMinutesAndSeconds(seconds(BG40)-seconds(BG39)-seconds(BG48)))","v":0},{"$f":"IF(ISBLANK(BH40),0,HoursMinutesAndSeconds(seconds(BH40)-seconds(BH39)-seconds(BH48)))","v":0},{"$f":"IF(ISBLANK(BI40),0,HoursMinutesAndSeconds(seconds(BI40)-seconds(BI39)-seconds(BI48)))","v":0},{"$f":"IF(ISBLANK(BJ40),0,HoursMinutesAndSeconds(seconds(BJ40)-seconds(BJ39)-seconds(BJ48)))","v":0}]
[null,"CP7",{"$f":"IF(ISBLANK(C41),0,HoursMinutesAndSeconds(seconds(C41)-seconds(C40)-seconds(C49)))","v":0},{"$f":"IF(ISBLANK(D41),0,HoursMinutesAndSeconds(seconds(D41)-seconds(D40)-seconds(D49)))","v":0},{"$f":"IF(ISBLANK(E41),0,HoursMinutesAndSeconds(seconds(E41)-seconds(E40)-seconds(E49)))","v":0},{"$f":"IF(ISBLANK(F41),0,HoursMinutesAndSeconds(seconds(F41)-seconds(F40)-seconds(F49)))","v":0},{"$f":"IF(ISBLANK(G41),0,HoursMinutesAndSeconds(seconds(G41)-seconds(G40)-seconds(G49)))","v":0},{"$f":"IF(ISBLANK(H41),0,HoursMinutesAndSeconds(seconds(H41)-seconds(H40)-seconds(H49)))","v":0},{"$f":"IF(ISBLANK(I41),0,HoursMinutesAndSeconds(seconds(I41)-seconds(I40)-seconds(I49)))","v":0},{"$f":"IF(ISBLANK(J41),0,HoursMinutesAndSeconds(seconds(J41)-seconds(J40)-seconds(J49)))","v":0},{"$f":"IF(ISBLANK(K41),0,HoursMinutesAndSeconds(seconds(K41)-seconds(K40)-seconds(K49)))","v":0},{"$f":"IF(ISBLANK(L41),0,HoursMinutesAndSeconds(seconds(L41)-seconds(L40)-seconds(L49)))","v":0},{"$f":"IF(ISBLANK(M41),0,HoursMinutesAndSeconds(seconds(M41)-seconds(M40)-seconds(M49)))","v":0},{"$f":"IF(ISBLANK(N41),0,HoursMinutesAndSeconds(seconds(N41)-seconds(N40)-seconds(N49)))","v":0},{"$f":"IF(ISBLANK(O41),0,HoursMinutesAndSeconds(seconds(O41)-seconds(O40)-seconds(O49)))","v":0},{"$f":"IF(ISBLANK(P41),0,HoursMinutesAndSeconds(seconds(P41)-seconds(P40)-seconds(P49)))","v":0},{"$f":"IF(ISBLANK(Q41),0,HoursMinutesAndSeconds(seconds(Q41)-seconds(Q40)-seconds(Q49)))","v":0},{"$f":"IF(ISBLANK(R41),0,HoursMinutesAndSeconds(seconds(R41)-seconds(R40)-seconds(R49)))","v":0},{"$f":"IF(ISBLANK(S41),0,HoursMinutesAndSeconds(seconds(S41)-seconds(S40)-seconds(S49)))","v":0},{"$f":"IF(ISBLANK(T41),0,HoursMinutesAndSeconds(seconds(T41)-seconds(T40)-seconds(T49)))","v":0},{"$f":"IF(ISBLANK(U41),0,HoursMinutesAndSeconds(seconds(U41)-seconds(U40)-seconds(U49)))","v":0},{"$f":"IF(ISBLANK(V41),0,HoursMinutesAndSeconds(seconds(V41)-seconds(V40)-seconds(V49)))","v":0},{"$f":"IF(ISBLANK(W41),0,HoursMinutesAndSeconds(seconds(W41)-seconds(W40)-seconds(W49)))","v":0},{"$f":"IF(ISBLANK(X41),0,HoursMinutesAndSeconds(seconds(X41)-seconds(X40)-seconds(X49)))","v":0},{"$f":"IF(ISBLANK(Y41),0,HoursMinutesAndSeconds(seconds(Y41)-seconds(Y40)-seconds(Y49)))","v":0},{"$f":"IF(ISBLANK(Z41),0,HoursMinutesAndSeconds(seconds(Z41)-seconds(Z40)-seconds(Z49)))","v":0},{"$f":"IF(ISBLANK(AA41),0,HoursMinutesAndSeconds(seconds(AA41)-seconds(AA40)-seconds(AA49)))","v":0},{"$f":"IF(ISBLANK(AB41),0,HoursMinutesAndSeconds(seconds(AB41)-seconds(AB40)-seconds(AB49)))","v":0},{"$f":"IF(ISBLANK(AC41),0,HoursMinutesAndSeconds(seconds(AC41)-seconds(AC40)-seconds(AC49)))","v":0},{"$f":"IF(ISBLANK(AD41),0,HoursMinutesAndSeconds(seconds(AD41)-seconds(AD40)-seconds(AD49)))","v":0},{"$f":"IF(ISBLANK(AE41),0,HoursMinutesAndSeconds(seconds(AE41)-seconds(AE40)-seconds(AE49)))","v":0},{"$f":"IF(ISBLANK(AF41),0,HoursMinutesAndSeconds(seconds(AF41)-seconds(AF40)-seconds(AF49)))","v":0},{"$f":"IF(ISBLANK(AG41),0,HoursMinutesAndSeconds(seconds(AG41)-seconds(AG40)-seconds(AG49)))","v":0},{"$f":"IF(ISBLANK(AH41),0,HoursMinutesAndSeconds(seconds(AH41)-seconds(AH40)-seconds(AH49)))","v":0},{"$f":"IF(ISBLANK(AI41),0,HoursMinutesAndSeconds(seconds(AI41)-seconds(AI40)-seconds(AI49)))","v":0},{"$f":"IF(ISBLANK(AJ41),0,HoursMinutesAndSeconds(seconds(AJ41)-seconds(AJ40)-seconds(AJ49)))","v":0},{"$f":"IF(ISBLANK(AK41),0,HoursMinutesAndSeconds(seconds(AK41)-seconds(AK40)-seconds(AK49)))","v":0},{"$f":"IF(ISBLANK(AL41),0,HoursMinutesAndSeconds(seconds(AL41)-seconds(AL40)-seconds(AL49)))","v":0},{"$f":"IF(ISBLANK(AM41),0,HoursMinutesAndSeconds(seconds(AM41)-seconds(AM40)-seconds(AM49)))","v":0},{"$f":"IF(ISBLANK(AN41),0,HoursMinutesAndSeconds(seconds(AN41)-seconds(AN40)-seconds(AN49)))","v":0},{"$f":"IF(ISBLANK(AO41),0,HoursMinutesAndSeconds(seconds(AO41)-seconds(AO40)-seconds(AO49)))","v":0},{"$f":"IF(ISBLANK(AP41),0,HoursMinutesAndSeconds(seconds(AP41)-seconds(AP40)-seconds(AP49)))","v":0},{"$f":"IF(ISBLANK(AQ41),0,HoursMinutesAndSeconds(seconds(AQ41)-seconds(AQ40)-seconds(AQ49)))","v":0},{"$f":"IF(ISBLANK(AR41),0,HoursMinutesAndSeconds(seconds(AR41)-seconds(AR40)-seconds(AR49)))","v":0},{"$f":"IF(ISBLANK(AS41),0,HoursMinutesAndSeconds(seconds(AS41)-seconds(AS40)-seconds(AS49)))","v":0},{"$f":"IF(ISBLANK(AT41),0,HoursMinutesAndSeconds(seconds(AT41)-seconds(AT40)-seconds(AT49)))","v":0},{"$f":"IF(ISBLANK(AU41),0,HoursMinutesAndSeconds(seconds(AU41)-seconds(AU40)-seconds(AU49)))","v":0},{"$f":"IF(ISBLANK(AV41),0,HoursMinutesAndSeconds(seconds(AV41)-seconds(AV40)-seconds(AV49)))","v":0},{"$f":"IF(ISBLANK(AW41),0,HoursMinutesAndSeconds(seconds(AW41)-seconds(AW40)-seconds(AW49)))","v":0},{"$f":"IF(ISBLANK(AX41),0,HoursMinutesAndSeconds(seconds(AX41)-seconds(AX40)-seconds(AX49)))","v":0},{"$f":"IF(ISBLANK(AY41),0,HoursMinutesAndSeconds(seconds(AY41)-seconds(AY40)-seconds(AY49)))","v":0},{"$f":"IF(ISBLANK(AZ41),0,HoursMinutesAndSeconds(seconds(AZ41)-seconds(AZ40)-seconds(AZ49)))","v":0},{"$f":"IF(ISBLANK(BA41),0,HoursMinutesAndSeconds(seconds(BA41)-seconds(BA40)-seconds(BA49)))","v":0},{"$f":"IF(ISBLANK(BB41),0,HoursMinutesAndSeconds(seconds(BB41)-seconds(BB40)-seconds(BB49)))","v":0},{"$f":"IF(ISBLANK(BC41),0,HoursMinutesAndSeconds(seconds(BC41)-seconds(BC40)-seconds(BC49)))","v":0},{"$f":"IF(ISBLANK(BD41),0,HoursMinutesAndSeconds(seconds(BD41)-seconds(BD40)-seconds(BD49)))","v":0},{"$f":"IF(ISBLANK(BE41),0,HoursMinutesAndSeconds(seconds(BE41)-seconds(BE40)-seconds(BE49)))","v":0},{"$f":"IF(ISBLANK(BF41),0,HoursMinutesAndSeconds(seconds(BF41)-seconds(BF40)-seconds(BF49)))","v":0},{"$f":"IF(ISBLANK(BG41),0,HoursMinutesAndSeconds(seconds(BG41)-seconds(BG40)-seconds(BG49)))","v":0},{"$f":"IF(ISBLANK(BH41),0,HoursMinutesAndSeconds(seconds(BH41)-seconds(BH40)-seconds(BH49)))","v":0},{"$f":"IF(ISBLANK(BI41),0,HoursMinutesAndSeconds(seconds(BI41)-seconds(BI40)-seconds(BI49)))","v":0},{"$f":"IF(ISBLANK(BJ41),0,HoursMinutesAndSeconds(seconds(BJ41)-seconds(BJ40)-seconds(BJ49)))","v":0}]
[null,"CP8",{"$f":"IF(ISBLANK(C42),0,HoursMinutesAndSeconds(seconds(C42)-seconds(C41)-seconds(C50)))","v":0},{"$f":"IF(ISBLANK(D42),0,HoursMinutesAndSeconds(seconds(D42)-seconds(D41)-seconds(D50)))","v":0},{"$f":"IF(ISBLANK(E42),0,HoursMinutesAndSeconds(seconds(E42)-seconds(E41)-seconds(E50)))","v":0},{"$f":"IF(ISBLANK(F42),0,HoursMinutesAndSeconds(seconds(F42)-seconds(F41)-seconds(F50)))","v":0},{"$f":"IF(ISBLANK(G42),0,HoursMinutesAndSeconds(seconds(G42)-seconds(G41)-seconds(G50)))","v":0},{"$f":"IF(ISBLANK(H42),0,HoursMinutesAndSeconds(seconds(H42)-seconds(H41)-seconds(H50)))","v":0},{"$f":"IF(ISBLANK(I42),0,HoursMinutesAndSeconds(seconds(I42)-seconds(I41)-seconds(I50)))","v":0},{"$f":"IF(ISBLANK(J42),0,HoursMinutesAndSeconds(seconds(J42)-seconds(J41)-seconds(J50)))","v":0},{"$f":"IF(ISBLANK(K42),0,HoursMinutesAndSeconds(seconds(K42)-seconds(K41)-seconds(K50)))","v":0},{"$f":"IF(ISBLANK(L42),0,HoursMinutesAndSeconds(seconds(L42)-seconds(L41)-seconds(L50)))","v":0},{"$f":"IF(ISBLANK(M42),0,HoursMinutesAndSeconds(seconds(M42)-seconds(M41)-seconds(M50)))","v":0},{"$f":"IF(ISBLANK(N42),0,HoursMinutesAndSeconds(seconds(N42)-seconds(N41)-seconds(N50)))","v":0},{"$f":"IF(ISBLANK(O42),0,HoursMinutesAndSeconds(seconds(O42)-seconds(O41)-seconds(O50)))","v":0},{"$f":"IF(ISBLANK(P42),0,HoursMinutesAndSeconds(seconds(P42)-seconds(P41)-seconds(P50)))","v":0},{"$f":"IF(ISBLANK(Q42),0,HoursMinutesAndSeconds(seconds(Q42)-seconds(Q41)-seconds(Q50)))","v":0},{"$f":"IF(ISBLANK(R42),0,HoursMinutesAndSeconds(seconds(R42)-seconds(R41)-seconds(R50)))","v":0},{"$f":"IF(ISBLANK(S42),0,HoursMinutesAndSeconds(seconds(S42)-seconds(S41)-seconds(S50)))","v":0},{"$f":"IF(ISBLANK(T42),0,HoursMinutesAndSeconds(seconds(T42)-seconds(T41)-seconds(T50)))","v":0},{"$f":"IF(ISBLANK(U42),0,HoursMinutesAndSeconds(seconds(U42)-seconds(U41)-seconds(U50)))","v":0},{"$f":"IF(ISBLANK(V42),0,HoursMinutesAndSeconds(seconds(V42)-seconds(V41)-seconds(V50)))","v":0},{"$f":"IF(ISBLANK(W42),0,HoursMinutesAndSeconds(seconds(W42)-seconds(W41)-seconds(W50)))","v":0},{"$f":"IF(ISBLANK(X42),0,HoursMinutesAndSeconds(seconds(X42)-seconds(X41)-seconds(X50)))","v":0},{"$f":"IF(ISBLANK(Y42),0,HoursMinutesAndSeconds(seconds(Y42)-seconds(Y41)-seconds(Y50)))","v":0},{"$f":"IF(ISBLANK(Z42),0,HoursMinutesAndSeconds(seconds(Z42)-seconds(Z41)-seconds(Z50)))","v":0},{"$f":"IF(ISBLANK(AA42),0,HoursMinutesAndSeconds(seconds(AA42)-seconds(AA41)-seconds(AA50)))","v":0},{"$f":"IF(ISBLANK(AB42),0,HoursMinutesAndSeconds(seconds(AB42)-seconds(AB41)-seconds(AB50)))","v":0},{"$f":"IF(ISBLANK(AC42),0,HoursMinutesAndSeconds(seconds(AC42)-seconds(AC41)-seconds(AC50)))","v":0},{"$f":"IF(ISBLANK(AD42),0,HoursMinutesAndSeconds(seconds(AD42)-seconds(AD41)-seconds(AD50)))","v":0},{"$f":"IF(ISBLANK(AE42),0,HoursMinutesAndSeconds(seconds(AE42)-seconds(AE41)-seconds(AE50)))","v":0},{"$f":"IF(ISBLANK(AF42),0,HoursMinutesAndSeconds(seconds(AF42)-seconds(AF41)-seconds(AF50)))","v":0},{"$f":"IF(ISBLANK(AG42),0,HoursMinutesAndSeconds(seconds(AG42)-seconds(AG41)-seconds(AG50)))","v":0},{"$f":"IF(ISBLANK(AH42),0,HoursMinutesAndSeconds(seconds(AH42)-seconds(AH41)-seconds(AH50)))","v":0},{"$f":"IF(ISBLANK(AI42),0,HoursMinutesAndSeconds(seconds(AI42)-seconds(AI41)-seconds(AI50)))","v":0},{"$f":"IF(ISBLANK(AJ42),0,HoursMinutesAndSeconds(seconds(AJ42)-seconds(AJ41)-seconds(AJ50)))","v":0},{"$f":"IF(ISBLANK(AK42),0,HoursMinutesAndSeconds(seconds(AK42)-seconds(AK41)-seconds(AK50)))","v":0},{"$f":"IF(ISBLANK(AL42),0,HoursMinutesAndSeconds(seconds(AL42)-seconds(AL41)-seconds(AL50)))","v":0},{"$f":"IF(ISBLANK(AM42),0,HoursMinutesAndSeconds(seconds(AM42)-seconds(AM41)-seconds(AM50)))","v":0},{"$f":"IF(ISBLANK(AN42),0,HoursMinutesAndSeconds(seconds(AN42)-seconds(AN41)-seconds(AN50)))","v":0},{"$f":"IF(ISBLANK(AO42),0,HoursMinutesAndSeconds(seconds(AO42)-seconds(AO41)-seconds(AO50)))","v":0},{"$f":"IF(ISBLANK(AP42),0,HoursMinutesAndSeconds(seconds(AP42)-seconds(AP41)-seconds(AP50)))","v":0},{"$f":"IF(ISBLANK(AQ42),0,HoursMinutesAndSeconds(seconds(AQ42)-seconds(AQ41)-seconds(AQ50)))","v":0},{"$f":"IF(ISBLANK(AR42),0,HoursMinutesAndSeconds(seconds(AR42)-seconds(AR41)-seconds(AR50)))","v":0},{"$f":"IF(ISBLANK(AS42),0,HoursMinutesAndSeconds(seconds(AS42)-seconds(AS41)-seconds(AS50)))","v":0},{"$f":"IF(ISBLANK(AT42),0,HoursMinutesAndSeconds(seconds(AT42)-seconds(AT41)-seconds(AT50)))","v":0},{"$f":"IF(ISBLANK(AU42),0,HoursMinutesAndSeconds(seconds(AU42)-seconds(AU41)-seconds(AU50)))","v":0},{"$f":"IF(ISBLANK(AV42),0,HoursMinutesAndSeconds(seconds(AV42)-seconds(AV41)-seconds(AV50)))","v":0},{"$f":"IF(ISBLANK(AW42),0,HoursMinutesAndSeconds(seconds(AW42)-seconds(AW41)-seconds(AW50)))","v":0},{"$f":"IF(ISBLANK(AX42),0,HoursMinutesAndSeconds(seconds(AX42)-seconds(AX41)-seconds(AX50)))","v":0},{"$f":"IF(ISBLANK(AY42),0,HoursMinutesAndSeconds(seconds(AY42)-seconds(AY41)-seconds(AY50)))","v":0},{"$f":"IF(ISBLANK(AZ42),0,HoursMinutesAndSeconds(seconds(AZ42)-seconds(AZ41)-seconds(AZ50)))","v":0},{"$f":"IF(ISBLANK(BA42),0,HoursMinutesAndSeconds(seconds(BA42)-seconds(BA41)-seconds(BA50)))","v":0},{"$f":"IF(ISBLANK(BB42),0,HoursMinutesAndSeconds(seconds(BB42)-seconds(BB41)-seconds(BB50)))","v":0},{"$f":"IF(ISBLANK(BC42),0,HoursMinutesAndSeconds(seconds(BC42)-seconds(BC41)-seconds(BC50)))","v":0},{"$f":"IF(ISBLANK(BD42),0,HoursMinutesAndSeconds(seconds(BD42)-seconds(BD41)-seconds(BD50)))","v":0},{"$f":"IF(ISBLANK(BE42),0,HoursMinutesAndSeconds(seconds(BE42)-seconds(BE41)-seconds(BE50)))","v":0},{"$f":"IF(ISBLANK(BF42),0,HoursMinutesAndSeconds(seconds(BF42)-seconds(BF41)-seconds(BF50)))","v":0},{"$f":"IF(ISBLANK(BG42),0,HoursMinutesAndSeconds(seconds(BG42)-seconds(BG41)-seconds(BG50)))","v":0},{"$f":"IF(ISBLANK(BH42),0,HoursMinutesAndSeconds(seconds(BH42)-seconds(BH41)-seconds(BH50)))","v":0},{"$f":"IF(ISBLANK(BI42),0,HoursMinutesAndSeconds(seconds(BI42)-seconds(BI41)-seconds(BI50)))","v":0},{"$f":"IF(ISBLANK(BJ42),0,HoursMinutesAndSeconds(seconds(BJ42)-seconds(BJ41)-seconds(BJ50)))","v":0}]
["Actual Total Run Time",null,{"$f":"HoursMinutesAndSeconds(C60)","v":13313},{"$f":"HoursMinutesAndSeconds(D60)","v":0},15625,14537,{"$f":"HoursMinutesAndSeconds(G60)","v":20505},{"$f":"HoursMinutesAndSeconds(H60)","v":13354},14806,14234,{"$f":"HoursMinutesAndSeconds(K60)","v":13202},{"$f":"HoursMinutesAndSeconds(L60)","v":14843},{"$f":"HoursMinutesAndSeconds(M60)","v":0},{"$f":"HoursMinutesAndSeconds(N60)","v":0},{"$f":"HoursMinutesAndSeconds(O60)","v":0},{"$f":"HoursMinutesAndSeconds(P60)","v":0},0,{"$f":"HoursMinutesAndSeconds(R60)","v":0},{"$f":"HoursMinutesAndSeconds(S60)","v":0},{"$f":"HoursMinutesAndSeconds(T60)","v":0},{"$f":"HoursMinutesAndSeconds(U60)","v":0},{"$f":"HoursMinutesAndSeconds(V60)","v":0},{"$f":"HoursMinutesAndSeconds(W60)","v":0},0,{"$f":"HoursMinutesAndSeconds(Y60)","v":0},{"$f":"HoursMinutesAndSeconds(Z60)","v":0},{"$f":"HoursMinutesAndSeconds(AA60)","v":0},{"$f":"HoursMinutesAndSeconds(AB60)","v":0},{"$f":"HoursMinutesAndSeconds(AC60)","v":0},{"$f":"HoursMinutesAndSeconds(AD60)","v":0},0,{"$f":"HoursMinutesAndSeconds(AF60)","v":0},{"$f":"HoursMinutesAndSeconds(AG60)","v":0},{"$f":"HoursMinutesAndSeconds(AH60)","v":0},{"$f":"HoursMinutesAndSeconds(AI60)","v":0},{"$f":"HoursMinutesAndSeconds(AJ60)","v":0},{"$f":"HoursMinutesAndSeconds(AK60)","v":0},0,{"$f":"HoursMinutesAndSeconds(AM60)","v":0},{"$f":"HoursMinutesAndSeconds(AN60)","v":0},{"$f":"HoursMinutesAndSeconds(AO60)","v":0},{"$f":"HoursMinutesAndSeconds(AP60)","v":0},{"$f":"HoursMinutesAndSeconds(AQ60)","v":0},{"$f":"HoursMinutesAndSeconds(AR60)","v":0},0,{"$f":"HoursMinutesAndSeconds(AT60)","v":0},{"$f":"HoursMinutesAndSeconds(AU60)","v":0},{"$f":"HoursMinutesAndSeconds(AV60)","v":0},{"$f":"HoursMinutesAndSeconds(AW60)","v":0},{"$f":"HoursMinutesAndSeconds(AX60)","v":0},{"$f":"HoursMinutesAndSeconds(AY60)","v":0},0,{"$f":"HoursMinutesAndSeconds(BA60)","v":0},{"$f":"HoursMinutesAndSeconds(BB60)","v":0},{"$f":"HoursMinutesAndSeconds(BC60)","v":0},{"$f":"HoursMinutesAndSeconds(BD60)","v":0},{"$f":"HoursMinutesAndSeconds(BE60)","v":0},{"$f":"HoursMinutesAndSeconds(BF60)","v":0},0,0,0,{"$f":"HoursMinutesAndSeconds(BJ60)","v":0}]
["Total Actual Seconds",null,{"$f":"seconds(C51)+seconds(C52)+seconds(C53)+seconds(C54)+seconds(C55)+seconds(C56)+seconds(C57)+seconds(C58)","v":5593},{"$f":"seconds(D51)+seconds(D52)+seconds(D53)+seconds(D54)+seconds(D55)+seconds(D56)+seconds(D57)+seconds(D58)","v":0},6985,6337,{"$f":"seconds(G51)+seconds(G52)+seconds(G53)+seconds(G54)+seconds(G55)+seconds(G56)+seconds(G57)+seconds(G58)","v":7505},5634,6486,6154,5522,6523,0,{"$f":"seconds(N51)+seconds(N52)+seconds(N53)+seconds(N54)+seconds(N55)+seconds(N56)+seconds(N57)+seconds(N58)","v":0},0,0,0,0,0,0,0,0,0,0,0,0,0,0,0,0,0,0,0,0,0,0,0,0,0,0,0,0,0,0,0,0,0,0,0,0,0,0,0,0,0,0,0,0,{"$f":"seconds(BG51)+seconds(BG52)+seconds(BG53)+seconds(BG54)+seconds(BG55)+seconds(BG56)+seconds(BG57)+seconds(BG58)","v":0},0,0,0]
["Seconds of Error","CP1",{"$f":"IF(ISBLANK(C35),0,seconds(C23)-seconds(C51))","v":-50},{"$f":"IF(ISBLANK(D35),0,seconds(D23)-seconds(D51))","v":0},{"$f":"IF(ISBLANK(E35),0,seconds(E23)-seconds(E51))","v":-21},{"$f":"IF(ISBLANK(F35),0,seconds(F23)-seconds(F51))","v":0},{"$f":"IF(ISBLANK(G35),0,seconds(G23)-seconds(G51))","v":0},{"$f":"IF(ISBLANK(H35),0,seconds(H23)-seconds(H51))","v":-38},{"$f":"IF(ISBLANK(I35),0,seconds(I23)-seconds(I51))","v":23},{"$f":"IF(ISBLANK(J35),0,seconds(J23)-seconds(J51))","v":15},{"$f":"IF(ISBLANK(K35),0,seconds(K23)-seconds(K51))","v":-43},{"$f":"IF(ISBLANK(L35),0,seconds(L23)-seconds(L51))","v":17},{"$f":"IF(ISBLANK(M35),0,seconds(M23)-seconds(M51))","v":0},{"$f":"IF(ISBLANK(N35),0,seconds(N23)-seconds(N51))","v":0},{"$f":"IF(ISBLANK(O35),0,seconds(O23)-seconds(O51))","v":0},{"$f":"IF(ISBLANK(P35),0,seconds(P23)-seconds(P51))","v":0},{"$f":"IF(ISBLANK(Q35),0,seconds(Q23)-seconds(Q51))","v":0},{"$f":"IF(ISBLANK(R35),0,seconds(R23)-seconds(R51))","v":0},{"$f":"IF(ISBLANK(S35),0,seconds(S23)-seconds(S51))","v":0},{"$f":"IF(ISBLANK(T35),0,seconds(T23)-seconds(T51))","v":0},{"$f":"IF(ISBLANK(U35),0,seconds(U23)-seconds(U51))","v":0},{"$f":"IF(ISBLANK(V35),0,seconds(V23)-seconds(V51))","v":0},{"$f":"IF(ISBLANK(W35),0,seconds(W23)-seconds(W51))","v":0},{"$f":"IF(ISBLANK(X35),0,seconds(X23)-seconds(X51))","v":0},{"$f":"IF(ISBLANK(Y35),0,seconds(Y23)-seconds(Y51))","v":0},{"$f":"IF(ISBLANK(Z35),0,seconds(Z23)-seconds(Z51))","v":0},{"$f":"IF(ISBLANK(AA35),0,seconds(AA23)-seconds(AA51))","v":0},{"$f":"IF(ISBLANK(AB35),0,seconds(AB23)-seconds(AB51))","v":0},{"$f":"IF(ISBLANK(AC35),0,seconds(AC23)-seconds(AC51))","v":0},{"$f":"IF(ISBLANK(AD35),0,seconds(AD23)-seconds(AD51))","v":0},{"$f":"IF(ISBLANK(AE35),0,seconds(AE23)-seconds(AE51))","v":0},{"$f":"IF(ISBLANK(AF35),0,seconds(AF23)-seconds(AF51))","v":0},{"$f":"IF(ISBLANK(AG35),0,seconds(AG23)-seconds(AG51))","v":0},{"$f":"IF(ISBLANK(AH35),0,seconds(AH23)-seconds(AH51))","v":0},{"$f":"IF(ISBLANK(AI35),0,seconds(AI23)-seconds(AI51))","v":0},{"$f":"IF(ISBLANK(AJ35),0,seconds(AJ23)-seconds(AJ51))","v":0},{"$f":"IF(ISBLANK(AK35),0,seconds(AK23)-seconds(AK51))","v":0},{"$f":"IF(ISBLANK(AL35),0,seconds(AL23)-seconds(AL51))","v":0},{"$f":"IF(ISBLANK(AM35),0,seconds(AM23)-seconds(AM51))","v":0},{"$f":"IF(ISBLANK(AN35),0,seconds(AN23)-seconds(AN51))","v":0},{"$f":"IF(ISBLANK(AO35),0,seconds(AO23)-seconds(AO51))","v":0},{"$f":"IF(ISBLANK(AP35),0,seconds(AP23)-seconds(AP51))","v":0},{"$f":"IF(ISBLANK(AQ35),0,seconds(AQ23)-seconds(AQ51))","v":0},{"$f":"IF(ISBLANK(AR35),0,seconds(AR23)-seconds(AR51))","v":0},{"$f":"IF(ISBLANK(AS35),0,seconds(AS23)-seconds(AS51))","v":0},{"$f":"IF(ISBLANK(AT35),0,seconds(AT23)-seconds(AT51))","v":0},{"$f":"IF(ISBLANK(AU35),0,seconds(AU23)-seconds(AU51))","v":0},{"$f":"IF(ISBLANK(AV35),0,seconds(AV23)-seconds(AV51))","v":0},{"$f":"IF(ISBLANK(AW35),0,seconds(AW23)-seconds(AW51))","v":0},{"$f":"IF(ISBLANK(AX35),0,seconds(AX23)-seconds(AX51))","v":0},{"$f":"IF(ISBLANK(AY35),0,seconds(AY23)-seconds(AY51))","v":0},{"$f":"IF(ISBLANK(AZ35),0,seconds(AZ23)-seconds(AZ51))","v":0},{"$f":"IF(ISBLANK(BA35),0,seconds(BA23)-seconds(BA51))","v":0},{"$f":"IF(ISBLANK(BB35),0,seconds(BB23)-seconds(BB51))","v":0},{"$f":"IF(ISBLANK(BC35),0,seconds(BC23)-seconds(BC51))","v":0},{"$f":"IF(ISBLANK(BD35),0,seconds(BD23)-seconds(BD51))","v":0},{"$f":"IF(ISBLANK(BE35),0,seconds(BE23)-seconds(BE51))","v":0},{"$f":"IF(ISBLANK(BF35),0,seconds(BF23)-seconds(BF51))","v":0},{"$f":"IF(ISBLANK(BG35),0,seconds(BG23)-seconds(BG51))","v":0},{"$f":"IF(ISBLANK(BH35),0,seconds(BH23)-seconds(BH51))","v":0},{"$f":"IF(ISBLANK(BI35),0,seconds(BI23)-seconds(BI51))","v":0},{"$f":"IF(ISBLANK(BJ35),0,seconds(BJ23)-seconds(BJ51))","v":0}]
[null,"CP2",{"$f":"IF(ISBLANK(C36),0,seconds(C24)-seconds(C52))","v":-17},{"$f":"IF(ISBLANK(D36),0,seconds(D24)-seconds(D52))","v":0},{"$f":"IF(ISBLANK(E36),0,seconds(E24)-seconds(E52))","v":59},{"$f":"IF(ISBLANK(F36),0,seconds(F24)-seconds(F52))","v":-3},{"$f":"IF(ISBLANK(G36),0,seconds(G24)-seconds(G52))","v":-11},{"$f":"IF(ISBLANK(H36),0,seconds(H24)-seconds(H52))","v":-122},{"$f":"IF(ISBLANK(I36),0,seconds(I24)-seconds(I52))","v":-1},{"$f":"IF(ISBLANK(J36),0,seconds(J24)-seconds(J52))","v":-1},{"$f":"IF(ISBLANK(K36),0,seconds(K24)-seconds(K52))","v":29},{"$f":"IF(ISBLANK(L36),0,seconds(L24)-seconds(L52))","v":-61},{"$f":"IF(ISBLANK(M36),0,seconds(M24)-seconds(M52))","v":0},{"$f":"IF(ISBLANK(N36),0,seconds(N24)-seconds(N52))","v":0},{"$f":"IF(ISBLANK(O36),0,seconds(O24)-seconds(O52))","v":0},{"$f":"IF(ISBLANK(P36),0,seconds(P24)-seconds(P52))","v":0},{"$f":"IF(ISBLANK(Q36),0,seconds(Q24)-seconds(Q52))","v":0},{"$f":"IF(ISBLANK(R36),0,seconds(R24)-seconds(R52))","v":0},{"$f":"IF(ISBLANK(S36),0,seconds(S24)-seconds(S52))","v":0},{"$f":"IF(ISBLANK(T36),0,seconds(T24)-seconds(T52))","v":0},{"$f":"IF(ISBLANK(U36),0,seconds(U24)-seconds(U52))","v":0},{"$f":"IF(ISBLANK(V36),0,seconds(V24)-seconds(V52))","v":0},{"$f":"IF(ISBLANK(W36),0,seconds(W24)-seconds(W52))","v":0},{"$f":"IF(ISBLANK(X36),0,seconds(X24)-seconds(X52))","v":0},{"$f":"IF(ISBLANK(Y36),0,seconds(Y24)-seconds(Y52))","v":0},{"$f":"IF(ISBLANK(Z36),0,seconds(Z24)-seconds(Z52))","v":0},{"$f":"IF(ISBLANK(AA36),0,seconds(AA24)-seconds(AA52))","v":0},{"$f":"IF(ISBLANK(AB36),0,seconds(AB24)-seconds(AB52))","v":0},{"$f":"IF(ISBLANK(AC36),0,seconds(AC24)-seconds(AC52))","v":0},{"$f":"IF(ISBLANK(AD36),0,seconds(AD24)-seconds(AD52))","v":0},{"$f":"IF(ISBLANK(AE36),0,seconds(AE24)-seconds(AE52))","v":0},{"$f":"IF(ISBLANK(AF36),0,seconds(AF24)-seconds(AF52))","v":0},{"$f":"IF(ISBLANK(AG36),0,seconds(AG24)-seconds(AG52))","v":0},{"$f":"IF(ISBLANK(AH36),0,seconds(AH24)-seconds(AH52))","v":0},{"$f":"IF(ISBLANK(AI36),0,seconds(AI24)-seconds(AI52))","v":0},{"$f":"IF(ISBLANK(AJ36),0,seconds(AJ24)-seconds(AJ52))","v":0},{"$f":"IF(ISBLANK(AK36),0,seconds(AK24)-seconds(AK52))","v":0},{"$f":"IF(ISBLANK(AL36),0,seconds(AL24)-seconds(AL52))","v":0},{"$f":"IF(ISBLANK(AM36),0,seconds(AM24)-seconds(AM52))","v":0},{"$f":"IF(ISBLANK(AN36),0,seconds(AN24)-seconds(AN52))","v":0},{"$f":"IF(ISBLANK(AO36),0,seconds(AO24)-seconds(AO52))","v":0},{"$f":"IF(ISBLANK(AP36),0,seconds(AP24)-seconds(AP52))","v":0},{"$f":"IF(ISBLANK(AQ36),0,seconds(AQ24)-seconds(AQ52))","v":0},{"$f":"IF(ISBLANK(AR36),0,seconds(AR24)-seconds(AR52))","v":0},{"$f":"IF(ISBLANK(AS36),0,seconds(AS24)-seconds(AS52))","v":0},{"$f":"IF(ISBLANK(AT36),0,seconds(AT24)-seconds(AT52))","v":0},{"$f":"IF(ISBLANK(AU36),0,seconds(AU24)-seconds(AU52))","v":0},{"$f":"IF(ISBLANK(AV36),0,seconds(AV24)-seconds(AV52))","v":0},{"$f":"IF(ISBLANK(AW36),0,seconds(AW24)-seconds(AW52))","v":0},{"$f":"IF(ISBLANK(AX36),0,seconds(AX24)-seconds(AX52))","v":0},{"$f":"IF(ISBLANK(AY36),0,seconds(AY24)-seconds(AY52))","v":0},{"$f":"IF(ISBLANK(AZ36),0,seconds(AZ24)-seconds(AZ52))","v":0},{"$f":"IF(ISBLANK(BA36),0,seconds(BA24)-seconds(BA52))","v":0},{"$f":"IF(ISBLANK(BB36),0,seconds(BB24)-seconds(BB52))","v":0},{"$f":"IF(ISBLANK(BC36),0,seconds(BC24)-seconds(BC52))","v":0},{"$f":"IF(ISBLANK(BD36),0,seconds(BD24)-seconds(BD52))","v":0},{"$f":"IF(ISBLANK(BE36),0,seconds(BE24)-seconds(BE52))","v":0},{"$f":"IF(ISBLANK(BF36),0,seconds(BF24)-seconds(BF52))","v":0},{"$f":"IF(ISBLANK(BG36),0,seconds(BG24)-seconds(BG52))","v":0},{"$f":"IF(ISBLANK(BH36),0,seconds(BH24)-seconds(BH52))","v":0},{"$f":"IF(ISBLANK(BI36),0,seconds(BI24)-seconds(BI52))","v":0},{"$f":"IF(ISBLANK(BJ36),0,seconds(BJ24)-seconds(BJ52))","v":0}]
[null,"CP3",{"$f":"IF(ISBLANK(C37),0,seconds(C25)-seconds(C53))","v":-11},{"$f":"IF(ISBLANK(D37),0,seconds(D25)-seconds(D53))","v":0},{"$f":"IF(ISBLANK(E37),0,seconds(E25)-seconds(E53))","v":30},{"$f":"IF(ISBLANK(F37),0,seconds(F25)-seconds(F53))","v":-5},{"$f":"IF(ISBLANK(G37),0,seconds(G25)-seconds(G53))","v":-20},{"$f":"IF(ISBLANK(H37),0,seconds(H25)-seconds(H53))","v":38},{"$f":"IF(ISBLANK(I37),0,seconds(I25)-seconds(I53))","v":17},{"$f":"IF(ISBLANK(J37),0,seconds(J25)-seconds(J53))","v":43},{"$f":"IF(ISBLANK(K37),0,seconds(K25)-seconds(K53))","v":-6},{"$f":"IF(ISBLANK(L37),0,seconds(L25)-seconds(L53))","v":5},{"$f":"IF(ISBLANK(M37),0,seconds(M25)-seconds(M53))","v":0},{"$f":"IF(ISBLANK(N37),0,seconds(N25)-seconds(N53))","v":0},{"$f":"IF(ISBLANK(O37),0,seconds(O25)-seconds(O53))","v":0},{"$f":"IF(ISBLANK(P37),0,seconds(P25)-seconds(P53))","v":0},{"$f":"IF(ISBLANK(Q37),0,seconds(Q25)-seconds(Q53))","v":0},{"$f":"IF(ISBLANK(R37),0,seconds(R25)-seconds(R53))","v":0},{"$f":"IF(ISBLANK(S37),0,seconds(S25)-seconds(S53))","v":0},{"$f":"IF(ISBLANK(T37),0,seconds(T25)-seconds(T53))","v":0},{"$f":"IF(ISBLANK(U37),0,seconds(U25)-seconds(U53))","v":0},{"$f":"IF(ISBLANK(V37),0,seconds(V25)-seconds(V53))","v":0},{"$f":"IF(ISBLANK(W37),0,seconds(W25)-seconds(W53))","v":0},{"$f":"IF(ISBLANK(X37),0,seconds(X25)-seconds(X53))","v":0},{"$f":"IF(ISBLANK(Y37),0,seconds(Y25)-seconds(Y53))","v":0},{"$f":"IF(ISBLANK(Z37),0,seconds(Z25)-seconds(Z53))","v":0},{"$f":"IF(ISBLANK(AA37),0,seconds(AA25)-seconds(AA53))","v":0},{"$f":"IF(ISBLANK(AB37),0,seconds(AB25)-seconds(AB53))","v":0},{"$f":"IF(ISBLANK(AC37),0,seconds(AC25)-seconds(AC53))","v":0},{"$f":"IF(ISBLANK(AD37),0,seconds(AD25)-seconds(AD53))","v":0},{"$f":"IF(ISBLANK(AE37),0,seconds(AE25)-seconds(AE53))","v":0},{"$f":"IF(ISBLANK(AF37),0,seconds(AF25)-seconds(AF53))","v":0},{"$f":"IF(ISBLANK(AG37),0,seconds(AG25)-seconds(AG53))","v":0},{"$f":"IF(ISBLANK(AH37),0,seconds(AH25)-seconds(AH53))","v":0},{"$f":"IF(ISBLANK(AI37),0,seconds(AI25)-seconds(AI53))","v":0},{"$f":"IF(ISBLANK(AJ37),0,seconds(AJ25)-seconds(AJ53))","v":0},{"$f":"IF(ISBLANK(AK37),0,seconds(AK25)-seconds(AK53))","v":0},{"$f":"IF(ISBLANK(AL37),0,seconds(AL25)-seconds(AL53))","v":0},{"$f":"IF(ISBLANK(AM37),0,seconds(AM25)-seconds(AM53))","v":0},{"$f":"IF(ISBLANK(AN37),0,seconds(AN25)-seconds(AN53))","v":0},{"$f":"IF(ISBLANK(AO37),0,seconds(AO25)-seconds(AO53))","v":0},{"$f":"IF(ISBLANK(AP37),0,seconds(AP25)-seconds(AP53))","v":0},{"$f":"IF(ISBLANK(AQ37),0,seconds(AQ25)-seconds(AQ53))","v":0},{"$f":"IF(ISBLANK(AR37),0,seconds(AR25)-seconds(AR53))","v":0},{"$f":"IF(ISBLANK(AS37),0,seconds(AS25)-seconds(AS53))","v":0},{"$f":"IF(ISBLANK(AT37),0,seconds(AT25)-seconds(AT53))","v":0},{"$f":"IF(ISBLANK(AU37),0,seconds(AU25)-seconds(AU53))","v":0},{"$f":"IF(ISBLANK(AV37),0,seconds(AV25)-seconds(AV53))","v":0},{"$f":"IF(ISBLANK(AW37),0,seconds(AW25)-seconds(AW53))","v":0},{"$f":"IF(ISBLANK(AX37),0,seconds(AX25)-seconds(AX53))","v":0},{"$f":"IF(ISBLANK(AY37),0,seconds(AY25)-seconds(AY53))","v":0},{"$f":"IF(ISBLANK(AZ37),0,seconds(AZ25)-seconds(AZ53))","v":0},{"$f":"IF(ISBLANK(BA37),0,seconds(BA25)-seconds(BA53))","v":0},{"$f":"IF(ISBLANK(BB37),0,seconds(BB25)-seconds(BB53))","v":0},{"$f":"IF(ISBLANK(BC37),0,seconds(BC25)-seconds(BC53))","v":0},{"$f":"IF(ISBLANK(BD37),0,seconds(BD25)-seconds(BD53))","v":0},{"$f":"IF(ISBLANK(BE37),0,seconds(BE25)-seconds(BE53))","v":0},{"$f":"IF(ISBLANK(BF37),0,seconds(BF25)-seconds(BF53))","v":0},{"$f":"IF(ISBLANK(BG37),0,seconds(BG25)-seconds(BG53))","v":0},{"$f":"IF(ISBLANK(BH37),0,seconds(BH25)-seconds(BH53))","v":0},{"$f":"IF(ISBLANK(BI37),0,seconds(BI25)-seconds(BI53))","v":0},{"$f":"IF(ISBLANK(BJ37),0,seconds(BJ25)-seconds(BJ53))","v":0}]
[null,"CP4",{"$f":"IF(ISBLANK(C38),0,seconds(C26)-seconds(C54))","v":17},{"$f":"IF(ISBLANK(D38),0,seconds(D26)-seconds(D54))","v":0},{"$f":"IF(ISBLANK(E38),0,seconds(E26)-seconds(E54))","v":-11},{"$f":"IF(ISBLANK(F38),0,seconds(F26)-seconds(F54))","v":-8},{"$f":"IF(ISBLANK(G38),0,seconds(G26)-seconds(G54))","v":10},{"$f":"IF(ISBLANK(H38),0,seconds(H26)-seconds(H54))","v":-12},{"$f":"IF(ISBLANK(I38),0,seconds(I26)-seconds(I54))","v":-3},{"$f":"IF(ISBLANK(J38),0,seconds(J26)-seconds(J54))","v":3},{"$f":"IF(ISBLANK(K38),0,seconds(K26)-seconds(K54))","v":2},{"$f":"IF(ISBLANK(L38),0,seconds(L26)-seconds(L54))","v":-36},{"$f":"IF(ISBLANK(M38),0,seconds(M26)-seconds(M54))","v":0},{"$f":"IF(ISBLANK(N38),0,seconds(N26)-seconds(N54))","v":0},{"$f":"IF(ISBLANK(O38),0,seconds(O26)-seconds(O54))","v":0},{"$f":"IF(ISBLANK(P38),0,seconds(P26)-seconds(P54))","v":0},{"$f":"IF(ISBLANK(Q38),0,seconds(Q26)-seconds(Q54))","v":0},{"$f":"IF(ISBLANK(R38),0,seconds(R26)-seconds(R54))","v":0},{"$f":"IF(ISBLANK(S38),0,seconds(S26)-seconds(S54))","v":0},{"$f":"IF(ISBLANK(T38),0,seconds(T26)-seconds(T54))","v":0},{"$f":"IF(ISBLANK(U38),0,seconds(U26)-seconds(U54))","v":0},{"$f":"IF(ISBLANK(V38),0,seconds(V26)-seconds(V54))","v":0},{"$f":"IF(ISBLANK(W38),0,seconds(W26)-seconds(W54))","v":0},{"$f":"IF(ISBLANK(X38),0,seconds(X26)-seconds(X54))","v":0},{"$f":"IF(ISBLANK(Y38),0,seconds(Y26)-seconds(Y54))","v":0},{"$f":"IF(ISBLANK(Z38),0,seconds(Z26)-seconds(Z54))","v":0},{"$f":"IF(ISBLANK(AA38),0,seconds(AA26)-seconds(AA54))","v":0},{"$f":"IF(ISBLANK(AB38),0,seconds(AB26)-seconds(AB54))","v":0},{"$f":"IF(ISBLANK(AC38),0,seconds(AC26)-seconds(AC54))","v":0},{"$f":"IF(ISBLANK(AD38),0,seconds(AD26)-seconds(AD54))","v":0},{"$f":"IF(ISBLANK(AE38),0,seconds(AE26)-seconds(AE54))","v":0},{"$f":"IF(ISBLANK(AF38),0,seconds(AF26)-seconds(AF54))","v":0},{"$f":"IF(ISBLANK(AG38),0,seconds(AG26)-seconds(AG54))","v":0},{"$f":"IF(ISBLANK(AH38),0,seconds(AH26)-seconds(AH54))","v":0},{"$f":"IF(ISBLANK(AI38),0,seconds(AI26)-seconds(AI54))","v":0},{"$f":"IF(ISBLANK(AJ38),0,seconds(AJ26)-seconds(AJ54))","v":0},{"$f":"IF(ISBLANK(AK38),0,seconds(AK26)-seconds(AK54))","v":0},{"$f":"IF(ISBLANK(AL38),0,seconds(AL26)-seconds(AL54))","v":0},{"$f":"IF(ISBLANK(AM38),0,seconds(AM26)-seconds(AM54))","v":0},{"$f":"IF(ISBLANK(AN38),0,seconds(AN26)-seconds(AN54))","v":0},{"$f":"IF(ISBLANK(AO38),0,seconds(AO26)-seconds(AO54))","v":0},{"$f":"IF(ISBLANK(AP38),0,seconds(AP26)-seconds(AP54))","v":0},{"$f":"IF(ISBLANK(AQ38),0,seconds(AQ26)-seconds(AQ54))","v":0},{"$f":"IF(ISBLANK(AR38),0,seconds(AR26)-seconds(AR54))","v":0},{"$f":"IF(ISBLANK(AS38),0,seconds(AS26)-seconds(AS54))","v":0},{"$f":"IF(ISBLANK(AT38),0,seconds(AT26)-seconds(AT54))","v":0},{"$f":"IF(ISBLANK(AU38),0,seconds(AU26)-seconds(AU54))","v":0},{"$f":"IF(ISBLANK(AV38),0,seconds(AV26)-seconds(AV54))","v":0},{"$f":"IF(ISBLANK(AW38),0,seconds(AW26)-seconds(AW54))","v":0},{"$f":"IF(ISBLANK(AX38),0,seconds(AX26)-seconds(AX54))","v":0},{"$f":"IF(ISBLANK(AY38),0,seconds(AY26)-seconds(AY54))","v":0},{"$f":"IF(ISBLANK(AZ38),0,seconds(AZ26)-seconds(AZ54))","v":0},{"$f":"IF(ISBLANK(BA38),0,seconds(BA26)-seconds(BA54))","v":0},{"$f":"IF(ISBLANK(BB38),0,seconds(BB26)-seconds(BB54))","v":0},{"$f":"IF(ISBLANK(BC38),0,seconds(BC26)-seconds(BC54))","v":0},{"$f":"IF(ISBLANK(BD38),0,seconds(BD26)-seconds(BD54))","v":0},{"$f":"IF(ISBLANK(BE38),0,seconds(BE26)-seconds(BE54))","v":0},{"$f":"IF(ISBLANK(BF38),0,seconds(BF26)-seconds(BF54))","v":0},{"$f":"IF(ISBLANK(BG38),0,seconds(BG26)-seconds(BG54))","v":0},{"$f":"IF(ISBLANK(BH38),0,seconds(BH26)-seconds(BH54))","v":0},{"$f":"IF(ISBLANK(BI38),0,seconds(BI26)-seconds(BI54))","v":0},{"$f":"IF(ISBLANK(BJ38),0,seconds(BJ26)-seconds(BJ54))","v":0}]
[null,"CP5",{"$f":"IF(ISBLANK(C39),0,seconds(C27)-seconds(C55))","v":0},{"$f":"IF(ISBLANK(D39),0,seconds(D27)-seconds(D55))","v":0},{"$f":"IF(ISBLANK(E39),0,seconds(E27)-seconds(E55))","v":0},{"$f":"IF(ISBLANK(F39),0,seconds(F27)-seconds(F55))","v":0},{"$f":"IF(ISBLANK(G39),0,seconds(G27)-seconds(G55))","v":0},{"$f":"IF(ISBLANK(H39),0,seconds(H27)-seconds(H55))","v":0},{"$f":"IF(ISBLANK(I39),0,seconds(I27)-seconds(I55))","v":0},{"$f":"IF(ISBLANK(J39),0,seconds(J27)-seconds(J55))","v":0},{"$f":"IF(ISBLANK(K39),0,seconds(K27)-seconds(K55))","v":0},{"$f":"IF(ISBLANK(L39),0,seconds(L27)-seconds(L55))","v":0},{"$f":"IF(ISBLANK(M39),0,seconds(M27)-seconds(M55))","v":0},{"$f":"IF(ISBLANK(N39),0,seconds(N27)-seconds(N55))","v":0},{"$f":"IF(ISBLANK(O39),0,seconds(O27)-seconds(O55))","v":0},{"$f":"IF(ISBLANK(P39),0,seconds(P27)-seconds(P55))","v":0},{"$f":"IF(ISBLANK(Q39),0,seconds(Q27)-seconds(Q55))","v":0},{"$f":"IF(ISBLANK(R39),0,seconds(R27)-seconds(R55))","v":0},{"$f":"IF(ISBLANK(S39),0,seconds(S27)-seconds(S55))","v":0},{"$f":"IF(ISBLANK(T39),0,seconds(T27)-seconds(T55))","v":0},{"$f":"IF(ISBLANK(U39),0,seconds(U27)-seconds(U55))","v":0},{"$f":"IF(ISBLANK(V39),0,seconds(V27)-seconds(V55))","v":0},{"$f":"IF(ISBLANK(W39),0,seconds(W27)-seconds(W55))","v":0},{"$f":"IF(ISBLANK(X39),0,seconds(X27)-seconds(X55))","v":0},{"$f":"IF(ISBLANK(Y39),0,seconds(Y27)-seconds(Y55))","v":0},{"$f":"IF(ISBLANK(Z39),0,seconds(Z27)-seconds(Z55))","v":0},{"$f":"IF(ISBLANK(AA39),0,seconds(AA27)-seconds(AA55))","v":0},{"$f":"IF(ISBLANK(AB39),0,seconds(AB27)-seconds(AB55))","v":0},{"$f":"IF(ISBLANK(AC39),0,seconds(AC27)-seconds(AC55))","v":0},{"$f":"IF(ISBLANK(AD39),0,seconds(AD27)-seconds(AD55))","v":0},{"$f":"IF(ISBLANK(AE39),0,seconds(AE27)-seconds(AE55))","v":0},{"$f":"IF(ISBLANK(AF39),0,seconds(AF27)-seconds(AF55))","v":0},{"$f":"IF(ISBLANK(AG39),0,seconds(AG27)-seconds(AG55))","v":0},{"$f":"IF(ISBLANK(AH39),0,seconds(AH27)-seconds(AH55))","v":0},{"$f":"IF(ISBLANK(AI39),0,seconds(AI27)-seconds(AI55))","v":0},{"$f":"IF(ISBLANK(AJ39),0,seconds(AJ27)-seconds(AJ55))","v":0},{"$f":"IF(ISBLANK(AK39),0,seconds(AK27)-seconds(AK55))","v":0},{"$f":"IF(ISBLANK(AL39),0,seconds(AL27)-seconds(AL55))","v":0},{"$f":"IF(ISBLANK(AM39),0,seconds(AM27)-seconds(AM55))","v":0},{"$f":"IF(ISBLANK(AN39),0,seconds(AN27)-seconds(AN55))","v":0},{"$f":"IF(ISBLANK(AO39),0,seconds(AO27)-seconds(AO55))","v":0},{"$f":"IF(ISBLANK(AP39),0,seconds(AP27)-seconds(AP55))","v":0},{"$f":"IF(ISBLANK(AQ39),0,seconds(AQ27)-seconds(AQ55))","v":0},{"$f":"IF(ISBLANK(AR39),0,seconds(AR27)-seconds(AR55))","v":0},{"$f":"IF(ISBLANK(AS39),0,seconds(AS27)-seconds(AS55))","v":0},{"$f":"IF(ISBLANK(AT39),0,seconds(AT27)-seconds(AT55))","v":0},{"$f":"IF(ISBLANK(AU39),0,seconds(AU27)-seconds(AU55))","v":0},{"$f":"IF(ISBLANK(AV39),0,seconds(AV27)-seconds(AV55))","v":0},{"$f":"IF(ISBLANK(AW39),0,seconds(AW27)-seconds(AW55))","v":0},{"$f":"IF(ISBLANK(AX39),0,seconds(AX27)-seconds(AX55))","v":0},{"$f":"IF(ISBLANK(AY39),0,seconds(AY27)-seconds(AY55))","v":0},{"$f":"IF(ISBLANK(AZ39),0,seconds(AZ27)-seconds(AZ55))","v":0},{"$f":"IF(ISBLANK(BA39),0,seconds(BA27)-seconds(BA55))","v":0},{"$f":"IF(ISBLANK(BB39),0,seconds(BB27)-seconds(BB55))","v":0},{"$f":"IF(ISBLANK(BC39),0,seconds(BC27)-seconds(BC55))","v":0},{"$f":"IF(ISBLANK(BD39),0,seconds(BD27)-seconds(BD55))","v":0},{"$f":"IF(ISBLANK(BE39),0,seconds(BE27)-seconds(BE55))","v":0},{"$f":"IF(ISBLANK(BF39),0,seconds(BF27)-seconds(BF55))","v":0},{"$f":"IF(ISBLANK(BG39),0,seconds(BG27)-seconds(BG55))","v":0},{"$f":"IF(ISBLANK(BH39),0,seconds(BH27)-seconds(BH55))","v":0},{"$f":"IF(ISBLANK(BI39),0,seconds(BI27)-seconds(BI55))","v":0},{"$f":"IF(ISBLANK(BJ39),0,seconds(BJ27)-seconds(BJ55))","v":0}]
[null,"CP6",{"$f":"IF(ISBLANK(C40),0,seconds(C28)-seconds(C56))","v":0},{"$f":"IF(ISBLANK(D40),0,seconds(D28)-seconds(D56))","v":0},{"$f":"IF(ISBLANK(E40),0,seconds(E28)-seconds(E56))","v":0},{"$f":"IF(ISBLANK(F40),0,seconds(F28)-seconds(F56))","v":0},{"$f":"IF(ISBLANK(G40),0,seconds(G28)-seconds(G56))","v":0},{"$f":"IF(ISBLANK(H40),0,seconds(H28)-seconds(H56))","v":0},{"$f":"IF(ISBLANK(I40),0,seconds(I28)-seconds(I56))","v":0},{"$f":"IF(ISBLANK(J40),0,seconds(J28)-seconds(J56))","v":0},{"$f":"IF(ISBLANK(K40),0,seconds(K28)-seconds(K56))","v":0},{"$f":"IF(ISBLANK(L40),0,seconds(L28)-seconds(L56))","v":0},{"$f":"IF(ISBLANK(M40),0,seconds(M28)-seconds(M56))","v":0},{"$f":"IF(ISBLANK(N40),0,seconds(N28)-seconds(N56))","v":0},{"$f":"IF(ISBLANK(O40),0,seconds(O28)-seconds(O56))","v":0},{"$f":"IF(ISBLANK(P40),0,seconds(P28)-seconds(P56))","v":0},{"$f":"IF(ISBLANK(Q40),0,seconds(Q28)-seconds(Q56))","v":0},{"$f":"IF(ISBLANK(R40),0,seconds(R28)-seconds(R56))","v":0},{"$f":"IF(ISBLANK(S40),0,seconds(S28)-seconds(S56))","v":0},{"$f":"IF(ISBLANK(T40),0,seconds(T28)-seconds(T56))","v":0},{"$f":"IF(ISBLANK(U40),0,seconds(U28)-seconds(U56))","v":0},{"$f":"IF(ISBLANK(V40),0,seconds(V28)-seconds(V56))","v":0},{"$f":"IF(ISBLANK(W40),0,seconds(W28)-seconds(W56))","v":0},{"$f":"IF(ISBLANK(X40),0,seconds(X28)-seconds(X56))","v":0},{"$f":"IF(ISBLANK(Y40),0,seconds(Y28)-seconds(Y56))","v":0},{"$f":"IF(ISBLANK(Z40),0,seconds(Z28)-seconds(Z56))","v":0},{"$f":"IF(ISBLANK(AA40),0,seconds(AA28)-seconds(AA56))","v":0},{"$f":"IF(ISBLANK(AB40),0,seconds(AB28)-seconds(AB56))","v":0},{"$f":"IF(ISBLANK(AC40),0,seconds(AC28)-seconds(AC56))","v":0},{"$f":"IF(ISBLANK(AD40),0,seconds(AD28)-seconds(AD56))","v":0},{"$f":"IF(ISBLANK(AE40),0,seconds(AE28)-seconds(AE56))","v":0},{"$f":"IF(ISBLANK(AF40),0,seconds(AF28)-seconds(AF56))","v":0},{"$f":"IF(ISBLANK(AG40),0,seconds(AG28)-seconds(AG56))","v":0},{"$f":"IF(ISBLANK(AH40),0,seconds(AH28)-seconds(AH56))","v":0},{"$f":"IF(ISBLANK(AI40),0,seconds(AI28)-seconds(AI56))","v":0},{"$f":"IF(ISBLANK(AJ40),0,seconds(AJ28)-seconds(AJ56))","v":0},{"$f":"IF(ISBLANK(AK40),0,seconds(AK28)-seconds(AK56))","v":0},{"$f":"IF(ISBLANK(AL40),0,seconds(AL28)-seconds(AL56))","v":0},{"$f":"IF(ISBLANK(AM40),0,seconds(AM28)-seconds(AM56))","v":0},{"$f":"IF(ISBLANK(AN40),0,seconds(AN28)-seconds(AN56))","v":0},{"$f":"IF(ISBLANK(AO40),0,seconds(AO28)-seconds(AO56))","v":0},{"$f":"IF(ISBLANK(AP40),0,seconds(AP28)-seconds(AP56))","v":0},{"$f":"IF(ISBLANK(AQ40),0,seconds(AQ28)-seconds(AQ56))","v":0},{"$f":"IF(ISBLANK(AR40),0,seconds(AR28)-seconds(AR56))","v":0},{"$f":"IF(ISBLANK(AS40),0,seconds(AS28)-seconds(AS56))","v":0},{"$f":"IF(ISBLANK(AT40),0,seconds(AT28)-seconds(AT56))","v":0},{"$f":"IF(ISBLANK(AU40),0,seconds(AU28)-seconds(AU56))","v":0},{"$f":"IF(ISBLANK(AV40),0,seconds(AV28)-seconds(AV56))","v":0},{"$f":"IF(ISBLANK(AW40),0,seconds(AW28)-seconds(AW56))","v":0},{"$f":"IF(ISBLANK(AX40),0,seconds(AX28)-seconds(AX56))","v":0},{"$f":"IF(ISBLANK(AY40),0,seconds(AY28)-seconds(AY56))","v":0},{"$f":"IF(ISBLANK(AZ40),0,seconds(AZ28)-seconds(AZ56))","v":0},{"$f":"IF(ISBLANK(BA40),0,seconds(BA28)-seconds(BA56))","v":0},{"$f":"IF(ISBLANK(BB40),0,seconds(BB28)-seconds(BB56))","v":0},{"$f":"IF(ISBLANK(BC40),0,seconds(BC28)-seconds(BC56))","v":0},{"$f":"IF(ISBLANK(BD40),0,seconds(BD28)-seconds(BD56))","v":0},{"$f":"IF(ISBLANK(BE40),0,seconds(BE28)-seconds(BE56))","v":0},{"$f":"IF(ISBLANK(BF40),0,seconds(BF28)-seconds(BF56))","v":0},{"$f":"IF(ISBLANK(BG40),0,seconds(BG28)-seconds(BG56))","v":0},{"$f":"IF(ISBLANK(BH40),0,seconds(BH28)-seconds(BH56))","v":0},{"$f":"IF(ISBLANK(BI40),0,seconds(BI28)-seconds(BI56))","v":0},{"$f":"IF(ISBLANK(BJ40),0,seconds(BJ28)-seconds(BJ56))","v":0}]
[null,"CP7",{"$f":"IF(ISBLANK(C41),0,seconds(C29)-seconds(C57))","v":0},{"$f":"IF(ISBLANK(D41),0,seconds(D29)-seconds(D57))","v":0},{"$f":"IF(ISBLANK(E41),0,seconds(E29)-seconds(E57))","v":0},{"$f":"IF(ISBLANK(F41),0,seconds(F29)-seconds(F57))","v":0},{"$f":"IF(ISBLANK(G41),0,seconds(G29)-seconds(G57))","v":0},{"$f":"IF(ISBLANK(H41),0,seconds(H29)-seconds(H57))","v":0},{"$f":"IF(ISBLANK(I41),0,seconds(I29)-seconds(I57))","v":0},{"$f":"IF(ISBLANK(J41),0,seconds(J29)-seconds(J57))","v":0},{"$f":"IF(ISBLANK(K41),0,seconds(K29)-seconds(K57))","v":0},{"$f":"IF(ISBLANK(L41),0,seconds(L29)-seconds(L57))","v":0},{"$f":"IF(ISBLANK(M41),0,seconds(M29)-seconds(M57))","v":0},{"$f":"IF(ISBLANK(N41),0,seconds(N29)-seconds(N57))","v":0},{"$f":"IF(ISBLANK(O41),0,seconds(O29)-seconds(O57))","v":0},{"$f":"IF(ISBLANK(P41),0,seconds(P29)-seconds(P57))","v":0},{"$f":"IF(ISBLANK(Q41),0,seconds(Q29)-seconds(Q57))","v":0},{"$f":"IF(ISBLANK(R41),0,seconds(R29)-seconds(R57))","v":0},{"$f":"IF(ISBLANK(S41),0,seconds(S29)-seconds(S57))","v":0},{"$f":"IF(ISBLANK(T41),0,seconds(T29)-seconds(T57))","v":0},{"$f":"IF(ISBLANK(U41),0,seconds(U29)-seconds(U57))","v":0},{"$f":"IF(ISBLANK(V41),0,seconds(V29)-seconds(V57))","v":0},{"$f":"IF(ISBLANK(W41),0,seconds(W29)-seconds(W57))","v":0},{"$f":"IF(ISBLANK(X41),0,seconds(X29)-seconds(X57))","v":0},{"$f":"IF(ISBLANK(Y41),0,seconds(Y29)-seconds(Y57))","v":0},{"$f":"IF(ISBLANK(Z41),0,seconds(Z29)-seconds(Z57))","v":0},{"$f":"IF(ISBLANK(AA41),0,seconds(AA29)-seconds(AA57))","v":0},{"$f":"IF(ISBLANK(AB41),0,seconds(AB29)-seconds(AB57))","v":0},{"$f":"IF(ISBLANK(AC41),0,seconds(AC29)-seconds(AC57))","v":0},{"$f":"IF(ISBLANK(AD41),0,seconds(AD29)-seconds(AD57))","v":0},{"$f":"IF(ISBLANK(AE41),0,seconds(AE29)-seconds(AE57))","v":0},{"$f":"IF(ISBLANK(AF41),0,seconds(AF29)-seconds(AF57))","v":0},{"$f":"IF(ISBLANK(AG41),0,seconds(AG29)-seconds(AG57))","v":0},{"$f":"IF(ISBLANK(AH41),0,seconds(AH29)-seconds(AH57))","v":0},{"$f":"IF(ISBLANK(AI41),0,seconds(AI29)-seconds(AI57))","v":0},{"$f":"IF(ISBLANK(AJ41),0,seconds(AJ29)-seconds(AJ57))","v":0},{"$f":"IF(ISBLANK(AK41),0,seconds(AK29)-seconds(AK57))","v":0},{"$f":"IF(ISBLANK(AL41),0,seconds(AL29)-seconds(AL57))","v":0},{"$f":"IF(ISBLANK(AM41),0,seconds(AM29)-seconds(AM57))","v":0},{"$f":"IF(ISBLANK(AN41),0,seconds(AN29)-seconds(AN57))","v":0},{"$f":"IF(ISBLANK(AO41),0,seconds(AO29)-seconds(AO57))","v":0},{"$f":"IF(ISBLANK(AP41),0,seconds(AP29)-seconds(AP57))","v":0},{"$f":"IF(ISBLANK(AQ41),0,seconds(AQ29)-seconds(AQ57))","v":0},{"$f":"IF(ISBLANK(AR41),0,seconds(AR29)-seconds(AR57))","v":0},{"$f":"IF(ISBLANK(AS41),0,seconds(AS29)-seconds(AS57))","v":0},{"$f":"IF(ISBLANK(AT41),0,seconds(AT29)-seconds(AT57))","v":0},{"$f":"IF(ISBLANK(AU41),0,seconds(AU29)-seconds(AU57))","v":0},{"$f":"IF(ISBLANK(AV41),0,seconds(AV29)-seconds(AV57))","v":0},{"$f":"IF(ISBLANK(AW41),0,seconds(AW29)-seconds(AW57))","v":0},{"$f":"IF(ISBLANK(AX41),0,seconds(AX29)-seconds(AX57))","v":0},{"$f":"IF(ISBLANK(AY41),0,seconds(AY29)-seconds(AY57))","v":0},{"$f":"IF(ISBLANK(AZ41),0,seconds(AZ29)-seconds(AZ57))","v":0},{"$f":"IF(ISBLANK(BA41),0,seconds(BA29)-seconds(BA57))","v":0},{"$f":"IF(ISBLANK(BB41),0,seconds(BB29)-seconds(BB57))","v":0},{"$f":"IF(ISBLANK(BC41),0,seconds(BC29)-seconds(BC57))","v":0},{"$f":"IF(ISBLANK(BD41),0,seconds(BD29)-seconds(BD57))","v":0},{"$f":"IF(ISBLANK(BE41),0,seconds(BE29)-seconds(BE57))","v":0},{"$f":"IF(ISBLANK(BF41),0,seconds(BF29)-seconds(BF57))","v":0},{"$f":"IF(ISBLANK(BG41),0,seconds(BG29)-seconds(BG57))","v":0},{"$f":"IF(ISBLANK(BH41),0,seconds(BH29)-seconds(BH57))","v":0},{"$f":"IF(ISBLANK(BI41),0,seconds(BI29)-seconds(BI57))","v":0},{"$f":"IF(ISBLANK(BJ41),0,seconds(BJ29)-seconds(BJ57))","v":0}]
[null,"CP8",{"$f":"IF(ISBLANK(C42),0,seconds(C30)-seconds(C58))","v":0},{"$f":"IF(ISBLANK(D42),0,seconds(D30)-seconds(D58))","v":0},{"$f":"IF(ISBLANK(E42),0,seconds(E30)-seconds(E58))","v":0},{"$f":"IF(ISBLANK(F42),0,seconds(F30)-seconds(F58))","v":0},{"$f":"IF(ISBLANK(G42),0,seconds(G30)-seconds(G58))","v":0},{"$f":"IF(ISBLANK(H42),0,seconds(H30)-seconds(H58))","v":0},{"$f":"IF(ISBLANK(I42),0,seconds(I30)-seconds(I58))","v":0},{"$f":"IF(ISBLANK(J42),0,seconds(J30)-seconds(J58))","v":0},{"$f":"IF(ISBLANK(K42),0,seconds(K30)-seconds(K58))","v":0},{"$f":"IF(ISBLANK(L42),0,seconds(L30)-seconds(L58))","v":0},{"$f":"IF(ISBLANK(M42),0,seconds(M30)-seconds(M58))","v":0},{"$f":"IF(ISBLANK(N42),0,seconds(N30)-seconds(N58))","v":0},{"$f":"IF(ISBLANK(O42),0,seconds(O30)-seconds(O58))","v":0},{"$f":"IF(ISBLANK(P42),0,seconds(P30)-seconds(P58))","v":0},{"$f":"IF(ISBLANK(Q42),0,seconds(Q30)-seconds(Q58))","v":0},{"$f":"IF(ISBLANK(R42),0,seconds(R30)-seconds(R58))","v":0},{"$f":"IF(ISBLANK(S42),0,seconds(S30)-seconds(S58))","v":0},{"$f":"IF(ISBLANK(T42),0,seconds(T30)-seconds(T58))","v":0},{"$f":"IF(ISBLANK(U42),0,seconds(U30)-seconds(U58))","v":0},{"$f":"IF(ISBLANK(V42),0,seconds(V30)-seconds(V58))","v":0},{"$f":"IF(ISBLANK(W42),0,seconds(W30)-seconds(W58))","v":0},{"$f":"IF(ISBLANK(X42),0,seconds(X30)-seconds(X58))","v":0},{"$f":"IF(ISBLANK(Y42),0,seconds(Y30)-seconds(Y58))","v":0},{"$f":"IF(ISBLANK(Z42),0,seconds(Z30)-seconds(Z58))","v":0},{"$f":"IF(ISBLANK(AA42),0,seconds(AA30)-seconds(AA58))","v":0},{"$f":"IF(ISBLANK(AB42),0,seconds(AB30)-seconds(AB58))","v":0},{"$f":"IF(ISBLANK(AC42),0,seconds(AC30)-seconds(AC58))","v":0},{"$f":"IF(ISBLANK(AD42),0,seconds(AD30)-seconds(AD58))","v":0},{"$f":"IF(ISBLANK(AE42),0,seconds(AE30)-seconds(AE58))","v":0},{"$f":"IF(ISBLANK(AF42),0,seconds(AF30)-seconds(AF58))","v":0},{"$f":"IF(ISBLANK(AG42),0,seconds(AG30)-seconds(AG58))","v":0},{"$f":"IF(ISBLANK(AH42),0,seconds(AH30)-seconds(AH58))","v":0},{"$f":"IF(ISBLANK(AI42),0,seconds(AI30)-seconds(AI58))","v":0},{"$f":"IF(ISBLANK(AJ42),0,seconds(AJ30)-seconds(AJ58))","v":0},{"$f":"IF(ISBLANK(AK42),0,seconds(AK30)-seconds(AK58))","v":0},{"$f":"IF(ISBLANK(AL42),0,seconds(AL30)-seconds(AL58))","v":0},{"$f":"IF(ISBLANK(AM42),0,seconds(AM30)-seconds(AM58))","v":0},{"$f":"IF(ISBLANK(AN42),0,seconds(AN30)-seconds(AN58))","v":0},{"$f":"IF(ISBLANK(AO42),0,seconds(AO30)-seconds(AO58))","v":0},{"$f":"IF(ISBLANK(AP42),0,seconds(AP30)-seconds(AP58))","v":0},{"$f":"IF(ISBLANK(AQ42),0,seconds(AQ30)-seconds(AQ58))","v":0},{"$f":"IF(ISBLANK(AR42),0,seconds(AR30)-seconds(AR58))","v":0},{"$f":"IF(ISBLANK(AS42),0,seconds(AS30)-seconds(AS58))","v":0},{"$f":"IF(ISBLANK(AT42),0,seconds(AT30)-seconds(AT58))","v":0},{"$f":"IF(ISBLANK(AU42),0,seconds(AU30)-seconds(AU58))","v":0},{"$f":"IF(ISBLANK(AV42),0,seconds(AV30)-seconds(AV58))","v":0},{"$f":"IF(ISBLANK(AW42),0,seconds(AW30)-seconds(AW58))","v":0},{"$f":"IF(ISBLANK(AX42),0,seconds(AX30)-seconds(AX58))","v":0},{"$f":"IF(ISBLANK(AY42),0,seconds(AY30)-seconds(AY58))","v":0},{"$f":"IF(ISBLANK(AZ42),0,seconds(AZ30)-seconds(AZ58))","v":0},{"$f":"IF(ISBLANK(BA42),0,seconds(BA30)-seconds(BA58))","v":0},{"$f":"IF(ISBLANK(BB42),0,seconds(BB30)-seconds(BB58))","v":0},{"$f":"IF(ISBLANK(BC42),0,seconds(BC30)-seconds(BC58))","v":0},{"$f":"IF(ISBLANK(BD42),0,seconds(BD30)-seconds(BD58))","v":0},{"$f":"IF(ISBLANK(BE42),0,seconds(BE30)-seconds(BE58))","v":0},{"$f":"IF(ISBLANK(BF42),0,seconds(BF30)-seconds(BF58))","v":0},{"$f":"IF(ISBLANK(BG42),0,seconds(BG30)-seconds(BG58))","v":0},{"$f":"IF(ISBLANK(BH42),0,seconds(BH30)-seconds(BH58))","v":0},{"$f":"IF(ISBLANK(BI42),0,seconds(BI30)-seconds(BI58))","v":0},{"$f":"IF(ISBLANK(BJ42),0,seconds(BJ30)-seconds(BJ58))","v":0}]
["Total Seconds of Error",null,{"$f":"ABS(C61)+ABS(C62)+ABS(C63)+ABS(C64)+ABS(C65)+ABS(C66)+ABS(C67)+ABS(C68)","v":95},{"$f":"ABS(D61)+ABS(D62)+ABS(D63)+ABS(D64)+ABS(D65)+ABS(D66)+ABS(D67)+ABS(D68)","v":0},121,16,41,210,44,62,80,{"$f":"ABS(L61)+ABS(L62)+ABS(L63)+ABS(L64)+ABS(L65)+ABS(L66)+ABS(L67)+ABS(L68)","v":119},0,{"$f":"ABS(N61)+ABS(N62)+ABS(N63)+ABS(N64)+ABS(N65)+ABS(N66)+ABS(N67)+ABS(N68)","v":0},0,0,0,0,0,0,0,0,0,0,0,0,0,0,0,0,0,0,0,0,0,0,0,0,0,0,0,0,0,0,0,0,0,0,0,0,0,0,0,0,0,0,0,0,{"$f":"ABS(BG61)+ABS(BG62)+ABS(BG63)+ABS(BG64)+ABS(BG65)+ABS(BG66)+ABS(BG67)+ABS(BG68)","v":0},0,0,0]
["Start Difference Time",null,{"$f":"IF(ISBLANK(C34),0,HoursMinutesAndSeconds(ABS(seconds(C34)-seconds(C22))))","v":257},{"$f":"IF(ISBLANK(D34),0,HoursMinutesAndSeconds(ABS(seconds(D34)-seconds(D22))))","v":0},{"$f":"IF(ISBLANK(E34),0,HoursMinutesAndSeconds(ABS(seconds(E34)-seconds(E22))))","v":327},{"$f":"IF(ISBLANK(F34),0,HoursMinutesAndSeconds(ABS(seconds(F34)-seconds(F22))))","v":232},{"$f":"IF(ISBLANK(G34),0,HoursMinutesAndSeconds(ABS(seconds(G34)-seconds(G22))))","v":133},{"$f":"IF(ISBLANK(H34),0,HoursMinutesAndSeconds(ABS(seconds(H34)-seconds(H22))))","v":55},{"$f":"IF(ISBLANK(I34),0,HoursMinutesAndSeconds(ABS(seconds(I34)-seconds(I22))))","v":337},{"$f":"IF(ISBLANK(J34),0,HoursMinutesAndSeconds(ABS(seconds(J34)-seconds(J22))))","v":225},{"$f":"IF(ISBLANK(K34),0,HoursMinutesAndSeconds(ABS(seconds(K34)-seconds(K22))))","v":335},{"$f":"IF(ISBLANK(L34),0,HoursMinutesAndSeconds(ABS(seconds(L34)-seconds(L22))))","v":30},{"$f":"IF(ISBLANK(M34),0,HoursMinutesAndSeconds(ABS(seconds(M34)-seconds(M22))))","v":0},{"$f":"IF(ISBLANK(N34),0,HoursMinutesAndSeconds(ABS(seconds(N34)-seconds(N22))))","v":0},{"$f":"IF(ISBLANK(O34),0,HoursMinutesAndSeconds(ABS(seconds(O34)-seconds(O22))))","v":0},{"$f":"IF(ISBLANK(P34),0,HoursMinutesAndSeconds(ABS(seconds(P34)-seconds(P22))))","v":0},{"$f":"IF(ISBLANK(Q34),0,HoursMinutesAndSeconds(ABS(seconds(Q34)-seconds(Q22))))","v":0},{"$f":"IF(ISBLANK(R34),0,HoursMinutesAndSeconds(ABS(seconds(R34)-seconds(R22))))","v":0},{"$f":"IF(ISBLANK(S34),0,HoursMinutesAndSeconds(ABS(seconds(S34)-seconds(S22))))","v":0},{"$f":"IF(ISBLANK(T34),0,HoursMinutesAndSeconds(ABS(seconds(T34)-seconds(T22))))","v":0},{"$f":"IF(ISBLANK(U34),0,HoursMinutesAndSeconds(ABS(seconds(U34)-seconds(U22))))","v":0},{"$f":"IF(ISBLANK(V34),0,HoursMinutesAndSeconds(ABS(seconds(V34)-seconds(V22))))","v":0},{"$f":"IF(ISBLANK(W34),0,HoursMinutesAndSeconds(ABS(seconds(W34)-seconds(W22))))","v":0},{"$f":"IF(ISBLANK(X34),0,HoursMinutesAndSeconds(ABS(seconds(X34)-seconds(X22))))","v":0},{"$f":"IF(ISBLANK(Y34),0,HoursMinutesAndSeconds(ABS(seconds(Y34)-seconds(Y22))))","v":0},{"$f":"IF(ISBLANK(Z34),0,HoursMinutesAndSeconds(ABS(seconds(Z34)-seconds(Z22))))","v":0},{"$f":"IF(ISBLANK(AA34),0,HoursMinutesAndSeconds(ABS(seconds(AA34)-seconds(AA22))))","v":0},{"$f":"IF(ISBLANK(AB34),0,HoursMinutesAndSeconds(ABS(seconds(AB34)-seconds(AB22))))","v":0},{"$f":"IF(ISBLANK(AC34),0,HoursMinutesAndSeconds(ABS(seconds(AC34)-seconds(AC22))))","v":0},{"$f":"IF(ISBLANK(AD34),0,HoursMinutesAndSeconds(ABS(seconds(AD34)-seconds(AD22))))","v":0},{"$f":"IF(ISBLANK(AE34),0,HoursMinutesAndSeconds(ABS(seconds(AE34)-seconds(AE22))))","v":0},{"$f":"IF(ISBLANK(AF34),0,HoursMinutesAndSeconds(ABS(seconds(AF34)-seconds(AF22))))","v":0},{"$f":"IF(ISBLANK(AG34),0,HoursMinutesAndSeconds(ABS(seconds(AG34)-seconds(AG22))))","v":0},{"$f":"IF(ISBLANK(AH34),0,HoursMinutesAndSeconds(ABS(seconds(AH34)-seconds(AH22))))","v":0},{"$f":"IF(ISBLANK(AI34),0,HoursMinutesAndSeconds(ABS(seconds(AI34)-seconds(AI22))))","v":0},{"$f":"IF(ISBLANK(AJ34),0,HoursMinutesAndSeconds(ABS(seconds(AJ34)-seconds(AJ22))))","v":0},{"$f":"IF(ISBLANK(AK34),0,HoursMinutesAndSeconds(ABS(seconds(AK34)-seconds(AK22))))","v":0},{"$f":"IF(ISBLANK(AL34),0,HoursMinutesAndSeconds(ABS(seconds(AL34)-seconds(AL22))))","v":0},{"$f":"IF(ISBLANK(AM34),0,HoursMinutesAndSeconds(ABS(seconds(AM34)-seconds(AM22))))","v":0},{"$f":"IF(ISBLANK(AN34),0,HoursMinutesAndSeconds(ABS(seconds(AN34)-seconds(AN22))))","v":0},{"$f":"IF(ISBLANK(AO34),0,HoursMinutesAndSeconds(ABS(seconds(AO34)-seconds(AO22))))","v":0},{"$f":"IF(ISBLANK(AP34),0,HoursMinutesAndSeconds(ABS(seconds(AP34)-seconds(AP22))))","v":0},{"$f":"IF(ISBLANK(AQ34),0,HoursMinutesAndSeconds(ABS(seconds(AQ34)-seconds(AQ22))))","v":0},{"$f":"IF(ISBLANK(AR34),0,HoursMinutesAndSeconds(ABS(seconds(AR34)-seconds(AR22))))","v":0},{"$f":"IF(ISBLANK(AS34),0,HoursMinutesAndSeconds(ABS(seconds(AS34)-seconds(AS22))))","v":0},{"$f":"IF(ISBLANK(AT34),0,HoursMinutesAndSeconds(ABS(seconds(AT34)-seconds(AT22))))","v":0},{"$f":"IF(ISBLANK(AU34),0,HoursMinutesAndSeconds(ABS(seconds(AU34)-seconds(AU22))))","v":0},{"$f":"IF(ISBLANK(AV34),0,HoursMinutesAndSeconds(ABS(seconds(AV34)-seconds(AV22))))","v":0},{"$f":"IF(ISBLANK(AW34),0,HoursMinutesAndSeconds(ABS(seconds(AW34)-seconds(AW22))))","v":0},{"$f":"IF(ISBLANK(AX34),0,HoursMinutesAndSeconds(ABS(seconds(AX34)-seconds(AX22))))","v":0},{"$f":"IF(ISBLANK(AY34),0,HoursMinutesAndSeconds(ABS(seconds(AY34)-seconds(AY22))))","v":0},{"$f":"IF(ISBLANK(AZ34),0,HoursMinutesAndSeconds(ABS(seconds(AZ34)-seconds(AZ22))))","v":0},{"$f":"IF(ISBLANK(BA34),0,HoursMinutesAndSeconds(ABS(seconds(BA34)-seconds(BA22))))","v":0},{"$f":"IF(ISBLANK(BB34),0,HoursMinutesAndSeconds(ABS(seconds(BB34)-seconds(BB22))))","v":0},{"$f":"IF(ISBLANK(BC34),0,HoursMinutesAndSeconds(ABS(seconds(BC34)-seconds(BC22))))","v":0},{"$f":"IF(ISBLANK(BD34),0,HoursMinutesAndSeconds(ABS(seconds(BD34)-seconds(BD22))))","v":0},{"$f":"IF(ISBLANK(BE34),0,HoursMinutesAndSeconds(ABS(seconds(BE34)-seconds(BE22))))","v":0},{"$f":"IF(ISBLANK(BF34),0,HoursMinutesAndSeconds(ABS(seconds(BF34)-seconds(BF22))))","v":0},{"$f":"IF(ISBLANK(BG34),0,HoursMinutesAndSeconds(ABS(seconds(BG34)-seconds(BG22))))","v":0},{"$f":"IF(ISBLANK(BH34),0,HoursMinutesAndSeconds(ABS(seconds(BH34)-seconds(BH22))))","v":0},{"$f":"IF(ISBLANK(BI34),0,HoursMinutesAndSeconds(ABS(seconds(BI34)-seconds(BI22))))","v":0},{"$f":"IF(ISBLANK(BJ34),0,HoursMinutesAndSeconds(ABS(seconds(BJ34)-seconds(BJ22))))","v":0}]
["Gross Error",null,{"$f":"IF(C33=0,0,C69/C33)","v":1.7172812725958064E-2},0,1.7182618574268674E-2,2.5312450561619996E-3,5.4783538214858369E-3,3.8181818181818185E-2,6.7463968107942347E-3,9.9774702285162532E-3,1.4534883720930232E-2,1.8455334987593053E-2,0,0,0,0,0,0,0,0,0,0,0,0,0,0,0,0,0,0,0,0,0,0,{"$f":"IF(AI33=0,0,AI69/AI33)","v":0},0,0,0,0,0,0,0,0,0,0,0,0,0,0,0,0,0,0,0,0,0,0,0,{"$f":"IF(BG33=0,0,BG69/BG33)","v":0},0,0,0]
["Predicted Speed",null,{"$f":"IF(C33=0,\"\",ROUND(('Contest Entry'!$B$4*3600)/C33,1))","v":9.1},{"$f":"IF(D33=0,\"\",ROUND(('Contest Entry'!$B$4*3600)/D33,1))","v":""},{"$f":"IF(E33=0,\"\",ROUND(('Contest Entry'!$B$4*3600)/E33,1))","v":7.2},{"$f":"IF(F33=0,\"\",ROUND(('Contest Entry'!$B$4*3600)/F33,1))","v":8},{"$f":"IF(G33=0,\"\",ROUND(('Contest Entry'!$B$4*3600)/G33,1))","v":6.7},{"$f":"IF(H33=0,\"\",ROUND(('Contest Entry'!$B$4*3600)/H33,1))","v":9.1999999999999993},{"$f":"IF(I33=0,\"\",ROUND(('Contest Entry'!$B$4*3600)/I33,1))","v":7.7},{"$f":"IF(J33=0,\"\",ROUND(('Contest Entry'!$B$4*3600)/J33,1))","v":8.1},{"$f":"IF(K33=0,\"\",ROUND(('Contest Entry'!$B$4*3600)/K33,1))","v":9.1999999999999993},{"$f":"IF(L33=0,\"\",ROUND(('Contest Entry'!$B$4*3600)/L33,1))","v":7.8},{"$f":"IF(M33=0,\"\",ROUND(('Contest Entry'!$B$4*3600)/M33,1))","v":""},{"$f":"IF(N33=0,\"\",ROUND(('Contest Entry'!$B$4*3600)/N33,1))","v":""},{"$f":"IF(O33=0,\"\",ROUND(('Contest Entry'!$B$4*3600)/O33,1))","v":""},{"$f":"IF(P33=0,\"\",ROUND(('Contest Entry'!$B$4*3600)/P33,1))","v":""},{"$f":"IF(Q33=0,\"\",ROUND(('Contest Entry'!$B$4*3600)/Q33,1))","v":""},{"$f":"IF(R33=0,\"\",ROUND(('Contest Entry'!$B$4*3600)/R33,1))","v":""},{"$f":"IF(S33=0,\"\",ROUND(('Contest Entry'!$B$4*3600)/S33,1))","v":""},{"$f":"IF(T33=0,\"\",ROUND(('Contest Entry'!$B$4*3600)/T33,1))","v":""},{"$f":"IF(U33=0,\"\",ROUND(('Contest Entry'!$B$4*3600)/U33,1))","v":""},{"$f":"IF(V33=0,\"\",ROUND(('Contest Entry'!$B$4*3600)/V33,1))","v":""},{"$f":"IF(W33=0,\"\",ROUND(('Contest Entry'!$B$4*3600)/W33,1))","v":""},{"$f":"IF(X33=0,\"\",ROUND(('Contest Entry'!$B$4*3600)/X33,1))","v":""},{"$f":"IF(Y33=0,\"\",ROUND(('Contest Entry'!$B$4*3600)/Y33,1))","v":""},{"$f":"IF(Z33=0,\"\",ROUND(('Contest Entry'!$B$4*3600)/Z33,1))","v":""},{"$f":"IF(AA33=0,\"\",ROUND(('Contest Entry'!$B$4*3600)/AA33,1))","v":""},{"$f":"IF(AB33=0,\"\",ROUND(('Contest Entry'!$B$4*3600)/AB33,1))","v":""},{"$f":"IF(AC33=0,\"\",ROUND(('Contest Entry'!$B$4*3600)/AC33,1))","v":""},{"$f":"IF(AD33=0,\"\",ROUND(('Contest Entry'!$B$4*3600)/AD33,1))","v":""},{"$f":"IF(AE33=0,\"\",ROUND(('Contest Entry'!$B$4*3600)/AE33,1))","v":""},{"$f":"IF(AF33=0,\"\",ROUND(('Contest Entry'!$B$4*3600)/AF33,1))","v":""},{"$f":"IF(AG33=0,\"\",ROUND(('Contest Entry'!$B$4*3600)/AG33,1))","v":""},{"$f":"IF(AH33=0,\"\",ROUND(('Contest Entry'!$B$4*3600)/AH33,1))","v":""},{"$f":"IF(AI33=0,\"\",ROUND(('Contest Entry'!$B$4*3600)/AI33,1))","v":""},{"$f":"IF(AJ33=0,\"\",ROUND(('Contest Entry'!$B$4*3600)/AJ33,1))","v":""},{"$f":"IF(AK33=0,\"\",ROUND(('Contest Entry'!$B$4*3600)/AK33,1))","v":""},{"$f":"IF(AL33=0,\"\",ROUND(('Contest Entry'!$B$4*3600)/AL33,1))","v":""},{"$f":"IF(AM33=0,\"\",ROUND(('Contest Entry'!$B$4*3600)/AM33,1))","v":""},{"$f":"IF(AN33=0,\"\",ROUND(('Contest Entry'!$B$4*3600)/AN33,1))","v":""},{"$f":"IF(AO33=0,\"\",ROUND(('Contest Entry'!$B$4*3600)/AO33,1))","v":""},{"$f":"IF(AP33=0,\"\",ROUND(('Contest Entry'!$B$4*3600)/AP33,1))","v":""},{"$f":"IF(AQ33=0,\"\",ROUND(('Contest Entry'!$B$4*3600)/AQ33,1))","v":""},{"$f":"IF(AR33=0,\"\",ROUND(('Contest Entry'!$B$4*3600)/AR33,1))","v":""},{"$f":"IF(AS33=0,\"\",ROUND(('Contest Entry'!$B$4*3600)/AS33,1))","v":""},{"$f":"IF(AT33=0,\"\",ROUND(('Contest Entry'!$B$4*3600)/AT33,1))","v":""},{"$f":"IF(AU33=0,\"\",ROUND(('Contest Entry'!$B$4*3600)/AU33,1))","v":""},{"$f":"IF(AV33=0,\"\",ROUND(('Contest Entry'!$B$4*3600)/AV33,1))","v":""},{"$f":"IF(AW33=0,\"\",ROUND(('Contest Entry'!$B$4*3600)/AW33,1))","v":""},{"$f":"IF(AX33=0,\"\",ROUND(('Contest Entry'!$B$4*3600)/AX33,1))","v":""},{"$f":"IF(AY33=0,\"\",ROUND(('Contest Entry'!$B$4*3600)/AY33,1))","v":""},{"$f":"IF(AZ33=0,\"\",ROUND(('Contest Entry'!$B$4*3600)/AZ33,1))","v":""},{"$f":"IF(BA33=0,\"\",ROUND(('Contest Entry'!$B$4*3600)/BA33,1))","v":""},{"$f":"IF(BB33=0,\"\",ROUND(('Contest Entry'!$B$4*3600)/BB33,1))","v":""},{"$f":"IF(BC33=0,\"\",ROUND(('Contest Entry'!$B$4*3600)/BC33,1))","v":""},{"$f":"IF(BD33=0,\"\",ROUND(('Contest Entry'!$B$4*3600)/BD33,1))","v":""},{"$f":"IF(BE33=0,\"\",ROUND(('Contest Entry'!$B$4*3600)/BE33,1))","v":""},{"$f":"IF(BF33=0,\"\",ROUND(('Contest Entry'!$B$4*3600)/BF33,1))","v":""},{"$f":"IF(BG33=0,\"\",ROUND(('Contest Entry'!$B$4*3600)/BG33,1))","v":""},{"$f":"IF(BH33=0,\"\",ROUND(('Contest Entry'!$B$4*3600)/BH33,1))","v":""},{"$f":"IF(BI33=0,\"\",ROUND(('Contest Entry'!$B$4*3600)/BI33,1))","v":""},{"$f":"IF(BJ33=0,\"\",ROUND(('Contest Entry'!$B$4*3600)/BJ33,1))","v":""}]
["Handicap",null,{"$f":"IF('Contest Entry'!$B$13=\"Yes\",IF(C72=\"\",0,MAX(0.5796,MIN(0.5*LOG(C72, 2.7182818)-0.0079*C72-0.3381,1.0479))),1)","v":0.69414721832116411},{"$f":"IF('Contest Entry'!$B$13=\"Yes\",IF(D72=\"\",0,MAX(0.5796,MIN(0.5*LOG(D72, 2.7182818)-0.0079*D72-0.3381,1.0479))),1)","v":0},{"$f":"IF('Contest Entry'!$B$13=\"Yes\",IF(E72=\"\",0,MAX(0.5796,MIN(0.5*LOG(E72, 2.7182818)-0.0079*E72-0.3381,1.0479))),1)","v":0.59206052334482306},{"$f":"IF('Contest Entry'!$B$13=\"Yes\",IF(F72=\"\",0,MAX(0.5796,MIN(0.5*LOG(F72, 2.7182818)-0.0079*F72-0.3381,1.0479))),1)","v":0.63842078172527206},{"$f":"IF('Contest Entry'!$B$13=\"Yes\",IF(G72=\"\",0,MAX(0.5796,MIN(0.5*LOG(G72, 2.7182818)-0.0079*G72-0.3381,1.0479))),1)","v":0.5796},{"$f":"IF('Contest Entry'!$B$13=\"Yes\",IF(H72=\"\",0,MAX(0.5796,MIN(0.5*LOG(H72, 2.7182818)-0.0079*H72-0.3381,1.0479))),1)","v":0.69882175364447008},{"$f":"IF('Contest Entry'!$B$13=\"Yes\",IF(I72=\"\",0,MAX(0.5796,MIN(0.5*LOG(I72, 2.7182818)-0.0079*I72-0.3381,1.0479))),1)","v":0.62168017511509488},{"$f":"IF('Contest Entry'!$B$13=\"Yes\",IF(J72=\"\",0,MAX(0.5796,MIN(0.5*LOG(J72, 2.7182818)-0.0079*J72-0.3381,1.0479))),1)","v":0.6438420417895796},{"$f":"IF('Contest Entry'!$B$13=\"Yes\",IF(K72=\"\",0,MAX(0.5796,MIN(0.5*LOG(K72, 2.7182818)-0.0079*K72-0.3381,1.0479))),1)","v":0.69882175364447008},{"$f":"IF('Contest Entry'!$B$13=\"Yes\",IF(L72=\"\",0,MAX(0.5796,MIN(0.5*LOG(L72, 2.7182818)-0.0079*L72-0.3381,1.0479))),1)","v":0.62734187760059501},{"$f":"IF('Contest Entry'!$B$13=\"Yes\",IF(M72=\"\",0,MAX(0.5796,MIN(0.5*LOG(M72, 2.7182818)-0.0079*M72-0.3381,1.0479))),1)","v":0},{"$f":"IF('Contest Entry'!$B$13=\"Yes\",IF(N72=\"\",0,MAX(0.5796,MIN(0.5*LOG(N72, 2.7182818)-0.0079*N72-0.3381,1.0479))),1)","v":0},{"$f":"IF('Contest Entry'!$B$13=\"Yes\",IF(O72=\"\",0,MAX(0.5796,MIN(0.5*LOG(O72, 2.7182818)-0.0079*O72-0.3381,1.0479))),1)","v":0},{"$f":"IF('Contest Entry'!$B$13=\"Yes\",IF(P72=\"\",0,MAX(0.5796,MIN(0.5*LOG(P72, 2.7182818)-0.0079*P72-0.3381,1.0479))),1)","v":0},{"$f":"IF('Contest Entry'!$B$13=\"Yes\",IF(Q72=\"\",0,MAX(0.5796,MIN(0.5*LOG(Q72, 2.7182818)-0.0079*Q72-0.3381,1.0479))),1)","v":0},{"$f":"IF('Contest Entry'!$B$13=\"Yes\",IF(R72=\"\",0,MAX(0.5796,MIN(0.5*LOG(R72, 2.7182818)-0.0079*R72-0.3381,1.0479))),1)","v":0},{"$f":"IF('Contest Entry'!$B$13=\"Yes\",IF(S72=\"\",0,MAX(0.5796,MIN(0.5*LOG(S72, 2.7182818)-0.0079*S72-0.3381,1.0479))),1)","v":0},{"$f":"IF('Contest Entry'!$B$13=\"Yes\",IF(T72=\"\",0,MAX(0.5796,MIN(0.5*LOG(T72, 2.7182818)-0.0079*T72-0.3381,1.0479))),1)","v":0},{"$f":"IF('Contest Entry'!$B$13=\"Yes\",IF(U72=\"\",0,MAX(0.5796,MIN(0.5*LOG(U72, 2.7182818)-0.0079*U72-0.3381,1.0479))),1)","v":0},{"$f":"IF('Contest Entry'!$B$13=\"Yes\",IF(V72=\"\",0,MAX(0.5796,MIN(0.5*LOG(V72, 2.7182818)-0.0079*V72-0.3381,1.0479))),1)","v":0},{"$f":"IF('Contest Entry'!$B$13=\"Yes\",IF(W72=\"\",0,MAX(0.5796,MIN(0.5*LOG(W72, 2.7182818)-0.0079*W72-0.3381,1.0479))),1)","v":0},{"$f":"IF('Contest Entry'!$B$13=\"Yes\",IF(X72=\"\",0,MAX(0.5796,MIN(0.5*LOG(X72, 2.7182818)-0.0079*X72-0.3381,1.0479))),1)","v":0},{"$f":"IF('Contest Entry'!$B$13=\"Yes\",IF(Y72=\"\",0,MAX(0.5796,MIN(0.5*LOG(Y72, 2.7182818)-0.0079*Y72-0.3381,1.0479))),1)","v":0},{"$f":"IF('Contest Entry'!$B$13=\"Yes\",IF(Z72=\"\",0,MAX(0.5796,MIN(0.5*LOG(Z72, 2.7182818)-0.0079*Z72-0.3381,1.0479))),1)","v":0},{"$f":"IF('Contest Entry'!$B$13=\"Yes\",IF(AA72=\"\",0,MAX(0.5796,MIN(0.5*LOG(AA72, 2.7182818)-0.0079*AA72-0.3381,1.0479))),1)","v":0},{"$f":"IF('Contest Entry'!$B$13=\"Yes\",IF(AB72=\"\",0,MAX(0.5796,MIN(0.5*LOG(AB72, 2.7182818)-0.0079*AB72-0.3381,1.0479))),1)","v":0},{"$f":"IF('Contest Entry'!$B$13=\"Yes\",IF(AC72=\"\",0,MAX(0.5796,MIN(0.5*LOG(AC72, 2.7182818)-0.0079*AC72-0.3381,1.0479))),1)","v":0},{"$f":"IF('Contest Entry'!$B$13=\"Yes\",IF(AD72=\"\",0,MAX(0.5796,MIN(0.5*LOG(AD72, 2.7182818)-0.0079*AD72-0.3381,1.0479))),1)","v":0},{"$f":"IF('Contest Entry'!$B$13=\"Yes\",IF(AE72=\"\",0,MAX(0.5796,MIN(0.5*LOG(AE72, 2.7182818)-0.0079*AE72-0.3381,1.0479))),1)","v":0},{"$f":"IF('Contest Entry'!$B$13=\"Yes\",IF(AF72=\"\",0,MAX(0.5796,MIN(0.5*LOG(AF72, 2.7182818)-0.0079*AF72-0.3381,1.0479))),1)","v":0},{"$f":"IF('Contest Entry'!$B$13=\"Yes\",IF(AG72=\"\",0,MAX(0.5796,MIN(0.5*LOG(AG72, 2.7182818)-0.0079*AG72-0.3381,1.0479))),1)","v":0},{"$f":"IF('Contest Entry'!$B$13=\"Yes\",IF(AH72=\"\",0,MAX(0.5796,MIN(0.5*LOG(AH72, 2.7182818)-0.0079*AH72-0.3381,1.0479))),1)","v":0},{"$f":"IF('Contest Entry'!$B$13=\"Yes\",IF(AI72=\"\",0,MAX(0.5796,MIN(0.5*LOG(AI72, 2.7182818)-0.0079*AI72-0.3381,1.0479))),1)","v":0},{"$f":"IF('Contest Entry'!$B$13=\"Yes\",IF(AJ72=\"\",0,MAX(0.5796,MIN(0.5*LOG(AJ72, 2.7182818)-0.0079*AJ72-0.3381,1.0479))),1)","v":0},{"$f":"IF('Contest Entry'!$B$13=\"Yes\",IF(AK72=\"\",0,MAX(0.5796,MIN(0.5*LOG(AK72, 2.7182818)-0.0079*AK72-0.3381,1.0479))),1)","v":0},{"$f":"IF('Contest Entry'!$B$13=\"Yes\",IF(AL72=\"\",0,MAX(0.5796,MIN(0.5*LOG(AL72, 2.7182818)-0.0079*AL72-0.3381,1.0479))),1)","v":0},{"$f":"IF('Contest Entry'!$B$13=\"Yes\",IF(AM72=\"\",0,MAX(0.5796,MIN(0.5*LOG(AM72, 2.7182818)-0.0079*AM72-0.3381,1.0479))),1)","v":0},{"$f":"IF('Contest Entry'!$B$13=\"Yes\",IF(AN72=\"\",0,MAX(0.5796,MIN(0.5*LOG(AN72, 2.7182818)-0.0079*AN72-0.3381,1.0479))),1)","v":0},{"$f":"IF('Contest Entry'!$B$13=\"Yes\",IF(AO72=\"\",0,MAX(0.5796,MIN(0.5*LOG(AO72, 2.7182818)-0.0079*AO72-0.3381,1.0479))),1)","v":0},{"$f":"IF('Contest Entry'!$B$13=\"Yes\",IF(AP72=\"\",0,MAX(0.5796,MIN(0.5*LOG(AP72, 2.7182818)-0.0079*AP72-0.3381,1.0479))),1)","v":0},{"$f":"IF('Contest Entry'!$B$13=\"Yes\",IF(AQ72=\"\",0,MAX(0.5796,MIN(0.5*LOG(AQ72, 2.7182818)-0.0079*AQ72-0.3381,1.0479))),1)","v":0},{"$f":"IF('Contest Entry'!$B$13=\"Yes\",IF(AR72=\"\",0,MAX(0.5796,MIN(0.5*LOG(AR72, 2.7182818)-0.0079*AR72-0.3381,1.0479))),1)","v":0},{"$f":"IF('Contest Entry'!$B$13=\"Yes\",IF(AS72=\"\",0,MAX(0.5796,MIN(0.5*LOG(AS72, 2.7182818)-0.0079*AS72-0.3381,1.0479))),1)","v":0},{"$f":"IF('Contest Entry'!$B$13=\"Yes\",IF(AT72=\"\",0,MAX(0.5796,MIN(0.5*LOG(AT72, 2.7182818)-0.0079*AT72-0.3381,1.0479))),1)","v":0},{"$f":"IF('Contest Entry'!$B$13=\"Yes\",IF(AU72=\"\",0,MAX(0.5796,MIN(0.5*LOG(AU72, 2.7182818)-0.0079*AU72-0.3381,1.0479))),1)","v":0},{"$f":"IF('Contest Entry'!$B$13=\"Yes\",IF(AV72=\"\",0,MAX(0.5796,MIN(0.5*LOG(AV72, 2.7182818)-0.0079*AV72-0.3381,1.0479))),1)","v":0},{"$f":"IF('Contest Entry'!$B$13=\"Yes\",IF(AW72=\"\",0,MAX(0.5796,MIN(0.5*LOG(AW72, 2.7182818)-0.0079*AW72-0.3381,1.0479))),1)","v":0},{"$f":"IF('Contest Entry'!$B$13=\"Yes\",IF(AX72=\"\",0,MAX(0.5796,MIN(0.5*LOG(AX72, 2.7182818)-0.0079*AX72-0.3381,1.0479))),1)","v":0},{"$f":"IF('Contest Entry'!$B$13=\"Yes\",IF(AY72=\"\",0,MAX(0.5796,MIN(0.5*LOG(AY72, 2.7182818)-0.0079*AY72-0.3381,1.0479))),1)","v":0},{"$f":"IF('Contest Entry'!$B$13=\"Yes\",IF(AZ72=\"\",0,MAX(0.5796,MIN(0.5*LOG(AZ72, 2.7182818)-0.0079*AZ72-0.3381,1.0479))),1)","v":0},{"$f":"IF('Contest Entry'!$B$13=\"Yes\",IF(BA72=\"\",0,MAX(0.5796,MIN(0.5*LOG(BA72, 2.7182818)-0.0079*BA72-0.3381,1.0479))),1)","v":0},{"$f":"IF('Contest Entry'!$B$13=\"Yes\",IF(BB72=\"\",0,MAX(0.5796,MIN(0.5*LOG(BB72, 2.7182818)-0.0079*BB72-0.3381,1.0479))),1)","v":0},{"$f":"IF('Contest Entry'!$B$13=\"Yes\",IF(BC72=\"\",0,MAX(0.5796,MIN(0.5*LOG(BC72, 2.7182818)-0.0079*BC72-0.3381,1.0479))),1)","v":0},{"$f":"IF('Contest Entry'!$B$13=\"Yes\",IF(BD72=\"\",0,MAX(0.5796,MIN(0.5*LOG(BD72, 2.7182818)-0.0079*BD72-0.3381,1.0479))),1)","v":0},{"$f":"IF('Contest Entry'!$B$13=\"Yes\",IF(BE72=\"\",0,MAX(0.5796,MIN(0.5*LOG(BE72, 2.7182818)-0.0079*BE72-0.3381,1.0479))),1)","v":0},{"$f":"IF('Contest Entry'!$B$13=\"Yes\",IF(BF72=\"\",0,MAX(0.5796,MIN(0.5*LOG(BF72, 2.7182818)-0.0079*BF72-0.3381,1.0479))),1)","v":0},{"$f":"IF('Contest Entry'!$B$13=\"Yes\",IF(BG72=\"\",0,MAX(0.5796,MIN(0.5*LOG(BG72, 2.7182818)-0.0079*BG72-0.3381,1.0479))),1)","v":0},{"$f":"IF('Contest Entry'!$B$13=\"Yes\",IF(BH72=\"\",0,MAX(0.5796,MIN(0.5*LOG(BH72, 2.7182818)-0.0079*BH72-0.3381,1.0479))),1)","v":0},{"$f":"IF('Contest Entry'!$B$13=\"Yes\",IF(BI72=\"\",0,MAX(0.5796,MIN(0.5*LOG(BI72, 2.7182818)-0.0079*BI72-0.3381,1.0479))),1)","v":0},{"$f":"IF('Contest Entry'!$B$13=\"Yes\",IF(BJ72=\"\",0,MAX(0.5796,MIN(0.5*LOG(BJ72, 2.7182818)-0.0079*BJ72-0.3381,1.0479))),1)","v":0}]
["Penalty"]
["Net Error",null,{"$f":"C71*C73+C74","v":1.1920460184474077E-2},{"$f":"D71*D73+D74","v":0},1.0173150145515989E-2,1.6159994474931739E-3,3.1752538749331913E-3,2.6682285139152495E-2,4.1941011507304771E-3,6.4239148038226475E-3,1.0157292930878926E-2,{"$f":"L71*L73+L74","v":1.157780450286458E-2},0,{"$f":"N71*N73+N74","v":0},0,0,0,0,0,0,0,0,0,0,0,0,0,0,0,0,0,0,0,0,0,0,0,0,0,0,0,0,0,0,0,0,0,0,0,0,0,0,0,0,0,0,0,0,{"$f":"BG71*BG73+BG74","v":0},0,0,0]
["Overall Rank",null,{"$f":"RANK(C75,$C$75:$BJ$75,1)-COUNTIF($C$69:$BJ$69,\"=0\")+COUNTIF($C$75:C75,C75)-1","v":8},{"$f":"RANK(D75,$C$75:$BJ$75,1)-COUNTIF($C$69:$BJ$69,\"=0\")+COUNTIF($C$75:D75,D75)-1","v":-50},{"$f":"RANK(E75,$C$75:$BJ$75,1)-COUNTIF($C$69:$BJ$69,\"=0\")+COUNTIF($C$75:E75,E75)-1","v":6},{"$f":"RANK(F75,$C$75:$BJ$75,1)-COUNTIF($C$69:$BJ$69,\"=0\")+COUNTIF($C$75:F75,F75)-1","v":1},{"$f":"RANK(G75,$C$75:$BJ$75,1)-COUNTIF($C$69:$BJ$69,\"=0\")+COUNTIF($C$75:G75,G75)-1","v":2},{"$f":"RANK(H75,$C$75:$BJ$75,1)-COUNTIF($C$69:$BJ$69,\"=0\")+COUNTIF($C$75:H75,H75)-1","v":9},{"$f":"RANK(I75,$C$75:$BJ$75,1)-COUNTIF($C$69:$BJ$69,\"=0\")+COUNTIF($C$75:I75,I75)-1","v":3},{"$f":"RANK(J75,$C$75:$BJ$75,1)-COUNTIF($C$69:$BJ$69,\"=0\")+COUNTIF($C$75:J75,J75)-1","v":4},{"$f":"RANK(K75,$C$75:$BJ$75,1)-COUNTIF($C$69:$BJ$69,\"=0\")+COUNTIF($C$75:K75,K75)-1","v":5},{"$f":"RANK(L75,$C$75:$BJ$75,1)-COUNTIF($C$69:$BJ$69,\"=0\")+COUNTIF($C$75:L75,L75)-1","v":7},{"$f":"RANK(M75,$C$75:$BJ$75,1)-COUNTIF($C$69:$BJ$69,\"=0\")+COUNTIF($C$75:M75,M75)-1","v":-49},{"$f":"RANK(N75,$C$75:$BJ$75,1)-COUNTIF($C$69:$BJ$69,\"=0\")+COUNTIF($C$75:N75,N75)-1","v":-48},{"$f":"RANK(O75,$C$75:$BJ$75,1)-COUNTIF($C$69:$BJ$69,\"=0\")+COUNTIF($C$75:O75,O75)-1","v":-47},{"$f":"RANK(P75,$C$75:$BJ$75,1)-COUNTIF($C$69:$BJ$69,\"=0\")+COUNTIF($C$75:P75,P75)-1","v":-46},{"$f":"RANK(Q75,$C$75:$BJ$75,1)-COUNTIF($C$69:$BJ$69,\"=0\")+COUNTIF($C$75:Q75,Q75)-1","v":-45},{"$f":"RANK(R75,$C$75:$BJ$75,1)-COUNTIF($C$69:$BJ$69,\"=0\")+COUNTIF($C$75:R75,R75)-1","v":-44},{"$f":"RANK(S75,$C$75:$BJ$75,1)-COUNTIF($C$69:$BJ$69,\"=0\")+COUNTIF($C$75:S75,S75)-1","v":-43},{"$f":"RANK(T75,$C$75:$BJ$75,1)-COUNTIF($C$69:$BJ$69,\"=0\")+COUNTIF($C$75:T75,T75)-1","v":-42},{"$f":"RANK(U75,$C$75:$BJ$75,1)-COUNTIF($C$69:$BJ$69,\"=0\")+COUNTIF($C$75:U75,U75)-1","v":-41},{"$f":"RANK(V75,$C$75:$BJ$75,1)-COUNTIF($C$69:$BJ$69,\"=0\")+COUNTIF($C$75:V75,V75)-1","v":-40},{"$f":"RANK(W75,$C$75:$BJ$75,1)-COUNTIF($C$69:$BJ$69,\"=0\")+COUNTIF($C$75:W75,W75)-1","v":-39},{"$f":"RANK(X75,$C$75:$BJ$75,1)-COUNTIF($C$69:$BJ$69,\"=0\")+COUNTIF($C$75:X75,X75)-1","v":-38},{"$f":"RANK(Y75,$C$75:$BJ$75,1)-COUNTIF($C$69:$BJ$69,\"=0\")+COUNTIF($C$75:Y75,Y75)-1","v":-37},{"$f":"RANK(Z75,$C$75:$BJ$75,1)-COUNTIF($C$69:$BJ$69,\"=0\")+COUNTIF($C$75:Z75,Z75)-1","v":-36},{"$f":"RANK(AA75,$C$75:$BJ$75,1)-COUNTIF($C$69:$BJ$69,\"=0\")+COUNTIF($C$75:AA75,AA75)-1","v":-35},{"$f":"RANK(AB75,$C$75:$BJ$75,1)-COUNTIF($C$69:$BJ$69,\"=0\")+COUNTIF($C$75:AB75,AB75)-1","v":-34},{"$f":"RANK(AC75,$C$75:$BJ$75,1)-COUNTIF($C$69:$BJ$69,\"=0\")+COUNTIF($C$75:AC75,AC75)-1","v":-33},{"$f":"RANK(AD75,$C$75:$BJ$75,1)-COUNTIF($C$69:$BJ$69,\"=0\")+COUNTIF($C$75:AD75,AD75)-1","v":-32},{"$f":"RANK(AE75,$C$75:$BJ$75,1)-COUNTIF($C$69:$BJ$69,\"=0\")+COUNTIF($C$75:AE75,AE75)-1","v":-31},{"$f":"RANK(AF75,$C$75:$BJ$75,1)-COUNTIF($C$69:$BJ$69,\"=0\")+COUNTIF($C$75:AF75,AF75)-1","v":-30},{"$f":"RANK(AG75,$C$75:$BJ$75,1)-COUNTIF($C$69:$BJ$69,\"=0\")+COUNTIF($C$75:AG75,AG75)-1","v":-29},{"$f":"RANK(AH75,$C$75:$BJ$75,1)-COUNTIF($C$69:$BJ$69,\"=0\")+COUNTIF($C$75:AH75,AH75)-1","v":-28},{"$f":"RANK(AI75,$C$75:$BJ$75,1)-COUNTIF($C$69:$BJ$69,\"=0\")+COUNTIF($C$75:AI75,AI75)-1","v":-27},{"$f":"RANK(AJ75,$C$75:$BJ$75,1)-COUNTIF($C$69:$BJ$69,\"=0\")+COUNTIF($C$75:AJ75,AJ75)-1","v":-26},{"$f":"RANK(AK75,$C$75:$BJ$75,1)-COUNTIF($C$69:$BJ$69,\"=0\")+COUNTIF($C$75:AK75,AK75)-1","v":-25},{"$f":"RANK(AL75,$C$75:$BJ$75,1)-COUNTIF($C$69:$BJ$69,\"=0\")+COUNTIF($C$75:AL75,AL75)-1","v":-24},{"$f":"RANK(AM75,$C$75:$BJ$75,1)-COUNTIF($C$69:$BJ$69,\"=0\")+COUNTIF($C$75:AM75,AM75)-1","v":-23},{"$f":"RANK(AN75,$C$75:$BJ$75,1)-COUNTIF($C$69:$BJ$69,\"=0\")+COUNTIF($C$75:AN75,AN75)-1","v":-22},{"$f":"RANK(AO75,$C$75:$BJ$75,1)-COUNTIF($C$69:$BJ$69,\"=0\")+COUNTIF($C$75:AO75,AO75)-1","v":-21},{"$f":"RANK(AP75,$C$75:$BJ$75,1)-COUNTIF($C$69:$BJ$69,\"=0\")+COUNTIF($C$75:AP75,AP75)-1","v":-20},{"$f":"RANK(AQ75,$C$75:$BJ$75,1)-COUNTIF($C$69:$BJ$69,\"=0\")+COUNTIF($C$75:AQ75,AQ75)-1","v":-19},{"$f":"RANK(AR75,$C$75:$BJ$75,1)-COUNTIF($C$69:$BJ$69,\"=0\")+COUNTIF($C$75:AR75,AR75)-1","v":-18},{"$f":"RANK(AS75,$C$75:$BJ$75,1)-COUNTIF($C$69:$BJ$69,\"=0\")+COUNTIF($C$75:AS75,AS75)-1","v":-17},{"$f":"RANK(AT75,$C$75:$BJ$75,1)-COUNTIF($C$69:$BJ$69,\"=0\")+COUNTIF($C$75:AT75,AT75)-1","v":-16},{"$f":"RANK(AU75,$C$75:$BJ$75,1)-COUNTIF($C$69:$BJ$69,\"=0\")+COUNTIF($C$75:AU75,AU75)-1","v":-15},{"$f":"RANK(AV75,$C$75:$BJ$75,1)-COUNTIF($C$69:$BJ$69,\"=0\")+COUNTIF($C$75:AV75,AV75)-1","v":-14},{"$f":"RANK(AW75,$C$75:$BJ$75,1)-COUNTIF($C$69:$BJ$69,\"=0\")+COUNTIF($C$75:AW75,AW75)-1","v":-13},{"$f":"RANK(AX75,$C$75:$BJ$75,1)-COUNTIF($C$69:$BJ$69,\"=0\")+COUNTIF($C$75:AX75,AX75)-1","v":-12},{"$f":"RANK(AY75,$C$75:$BJ$75,1)-COUNTIF($C$69:$BJ$69,\"=0\")","v":-50},-50,-50,-50,-50,-50,-50,-50,{"$f":"RANK(BG75,$C$75:$BJ$75,1)-COUNTIF($C$69:$BJ$69,\"=0\")","v":-50},-50,-50,-50]
["Rank By Predicted Seconds",null,{"$f":"IF(C76<=3,\"\",1+SUMPRODUCT(($C$76:$BJ$76>3)*(C33<$C$33:$BJ$33))+COUNTIF($C$33:C33,C33)-1)","v":4},{"$f":"IF(D76<=3,\"\",1+SUMPRODUCT(($C$76:$BJ$76>3)*(D33<$C$33:$BJ$33))+COUNTIF($C$33:D33,D33)-1)","v":""},{"$f":"IF(E76<=3,\"\",1+SUMPRODUCT(($C$76:$BJ$76>3)*(E33<$C$33:$BJ$33))+COUNTIF($C$33:E33,E33)-1)","v":1},{"$f":"IF(F76<=3,\"\",1+SUMPRODUCT(($C$76:$BJ$76>3)*(F33<$C$33:$BJ$33))+COUNTIF($C$33:F33,F33)-1)","v":""},{"$f":"IF(G76<=3,\"\",1+SUMPRODUCT(($C$76:$BJ$76>3)*(G33<$C$33:$BJ$33))+COUNTIF($C$33:G33,G33)-1)","v":""},{"$f":"IF(H76<=3,\"\",1+SUMPRODUCT(($C$76:$BJ$76>3)*(H33<$C$33:$BJ$33))+COUNTIF($C$33:H33,H33)-1)","v":6},{"$f":"IF(I76<=3,\"\",1+SUMPRODUCT(($C$76:$BJ$76>3)*(I33<$C$33:$BJ$33))+COUNTIF($C$33:I33,I33)-1)","v":""},{"$f":"IF(J76<=3,\"\",1+SUMPRODUCT(($C$76:$BJ$76>3)*(J33<$C$33:$BJ$33))+COUNTIF($C$33:J33,J33)-1)","v":3},{"$f":"IF(K76<=3,\"\",1+SUMPRODUCT(($C$76:$BJ$76>3)*(K33<$C$33:$BJ$33))+COUNTIF($C$33:K33,K33)-1)","v":5},{"$f":"IF(L76<=3,\"\",1+SUMPRODUCT(($C$76:$BJ$76>3)*(L33<$C$33:$BJ$33))+COUNTIF($C$33:L33,L33)-1)","v":2},{"$f":"IF(M76<=3,\"\",1+SUMPRODUCT(($C$76:$BJ$76>3)*(M33<$C$33:$BJ$33))+COUNTIF($C$33:M33,M33)-1)","v":""},{"$f":"IF(N76<=3,\"\",1+SUMPRODUCT(($C$76:$BJ$76>3)*(N33<$C$33:$BJ$33))+COUNTIF($C$33:N33,N33)-1)","v":""},{"$f":"IF(O76<=3,\"\",1+SUMPRODUCT(($C$76:$BJ$76>3)*(O33<$C$33:$BJ$33))+COUNTIF($C$33:O33,O33)-1)","v":""},{"$f":"IF(P76<=3,\"\",1+SUMPRODUCT(($C$76:$BJ$76>3)*(P33<$C$33:$BJ$33))+COUNTIF($C$33:P33,P33)-1)","v":""},{"$f":"IF(Q76<=3,\"\",1+SUMPRODUCT(($C$76:$BJ$76>3)*(Q33<$C$33:$BJ$33))+COUNTIF($C$33:Q33,Q33)-1)","v":""},{"$f":"IF(R76<=3,\"\",1+SUMPRODUCT(($C$76:$BJ$76>3)*(R33<$C$33:$BJ$33))+COUNTIF($C$33:R33,R33)-1)","v":""},{"$f":"IF(S76<=3,\"\",1+SUMPRODUCT(($C$76:$BJ$76>3)*(S33<$C$33:$BJ$33))+COUNTIF($C$33:S33,S33)-1)","v":""},{"$f":"IF(T76<=3,\"\",1+SUMPRODUCT(($C$76:$BJ$76>3)*(T33<$C$33:$BJ$33))+COUNTIF($C$33:T33,T33)-1)","v":""},{"$f":"IF(U76<=3,\"\",1+SUMPRODUCT(($C$76:$BJ$76>3)*(U33<$C$33:$BJ$33))+COUNTIF($C$33:U33,U33)-1)","v":""},{"$f":"IF(V76<=3,\"\",1+SUMPRODUCT(($C$76:$BJ$76>3)*(V33<$C$33:$BJ$33))+COUNTIF($C$33:V33,V33)-1)","v":""},{"$f":"IF(W76<=3,\"\",1+SUMPRODUCT(($C$76:$BJ$76>3)*(W33<$C$33:$BJ$33))+COUNTIF($C$33:W33,W33)-1)","v":""},{"$f":"IF(X76<=3,\"\",1+SUMPRODUCT(($C$76:$BJ$76>3)*(X33<$C$33:$BJ$33))+COUNTIF($C$33:X33,X33)-1)","v":""},{"$f":"IF(Y76<=3,\"\",1+SUMPRODUCT(($C$76:$BJ$76>3)*(Y33<$C$33:$BJ$33))+COUNTIF($C$33:Y33,Y33)-1)","v":""},{"$f":"IF(Z76<=3,\"\",1+SUMPRODUCT(($C$76:$BJ$76>3)*(Z33<$C$33:$BJ$33))+COUNTIF($C$33:Z33,Z33)-1)","v":""},{"$f":"IF(AA76<=3,\"\",1+SUMPRODUCT(($C$76:$BJ$76>3)*(AA33<$C$33:$BJ$33))+COUNTIF($C$33:AA33,AA33)-1)","v":""},{"$f":"IF(AB76<=3,\"\",1+SUMPRODUCT(($C$76:$BJ$76>3)*(AB33<$C$33:$BJ$33))+COUNTIF($C$33:AB33,AB33)-1)","v":""},{"$f":"IF(AC76<=3,\"\",1+SUMPRODUCT(($C$76:$BJ$76>3)*(AC33<$C$33:$BJ$33))+COUNTIF($C$33:AC33,AC33)-1)","v":""},{"$f":"IF(AD76<=3,\"\",1+SUMPRODUCT(($C$76:$BJ$76>3)*(AD33<$C$33:$BJ$33))+COUNTIF($C$33:AD33,AD33)-1)","v":""},{"$f":"IF(AE76<=3,\"\",1+SUMPRODUCT(($C$76:$BJ$76>3)*(AE33<$C$33:$BJ$33))+COUNTIF($C$33:AE33,AE33)-1)","v":""},{"$f":"IF(AF76<=3,\"\",1+SUMPRODUCT(($C$76:$BJ$76>3)*(AF33<$C$33:$BJ$33))+COUNTIF($C$33:AF33,AF33)-1)","v":""},{"$f":"IF(AG76<=3,\"\",1+SUMPRODUCT(($C$76:$BJ$76>3)*(AG33<$C$33:$BJ$33))+COUNTIF($C$33:AG33,AG33)-1)","v":""},{"$f":"IF(AH76<=3,\"\",1+SUMPRODUCT(($C$76:$BJ$76>3)*(AH33<$C$33:$BJ$33))+COUNTIF($C$33:AH33,AH33)-1)","v":""},{"$f":"IF(AI76<=3,\"\",1+SUMPRODUCT(($C$76:$BJ$76>3)*(AI33<$C$33:$BJ$33))+COUNTIF($C$33:AI33,AI33)-1)","v":""},{"$f":"IF(AJ76<=3,\"\",1+SUMPRODUCT(($C$76:$BJ$76>3)*(AJ33<$C$33:$BJ$33))+COUNTIF($C$33:AJ33,AJ33)-1)","v":""},{"$f":"IF(AK76<=3,\"\",1+SUMPRODUCT(($C$76:$BJ$76>3)*(AK33<$C$33:$BJ$33))+COUNTIF($C$33:AK33,AK33)-1)","v":""},{"$f":"IF(AL76<=3,\"\",1+SUMPRODUCT(($C$76:$BJ$76>3)*(AL33<$C$33:$BJ$33))+COUNTIF($C$33:AL33,AL33)-1)","v":""},{"$f":"IF(AM76<=3,\"\",1+SUMPRODUCT(($C$76:$BJ$76>3)*(AM33<$C$33:$BJ$33))+COUNTIF($C$33:AM33,AM33)-1)","v":""},{"$f":"IF(AN76<=3,\"\",1+SUMPRODUCT(($C$76:$BJ$76>3)*(AN33<$C$33:$BJ$33))+COUNTIF($C$33:AN33,AN33)-1)","v":""},{"$f":"IF(AO76<=3,\"\",1+SUMPRODUCT(($C$76:$BJ$76>3)*(AO33<$C$33:$BJ$33))+COUNTIF($C$33:AO33,AO33)-1)","v":""},{"$f":"IF(AP76<=3,\"\",1+SUMPRODUCT(($C$76:$BJ$76>3)*(AP33<$C$33:$BJ$33))+COUNTIF($C$33:AP33,AP33)-1)","v":""},{"$f":"IF(AQ76<=3,\"\",1+SUMPRODUCT(($C$76:$BJ$76>3)*(AQ33<$C$33:$BJ$33))+COUNTIF($C$33:AQ33,AQ33)-1)","v":""},{"$f":"IF(AR76<=3,\"\",1+SUMPRODUCT(($C$76:$BJ$76>3)*(AR33<$C$33:$BJ$33))+COUNTIF($C$33:AR33,AR33)-1)","v":""},{"$f":"IF(AS76<=3,\"\",1+SUMPRODUCT(($C$76:$BJ$76>3)*(AS33<$C$33:$BJ$33))+COUNTIF($C$33:AS33,AS33)-1)","v":""},{"$f":"IF(AT76<=3,\"\",1+SUMPRODUCT(($C$76:$BJ$76>3)*(AT33<$C$33:$BJ$33))+COUNTIF($C$33:AT33,AT33)-1)","v":""},{"$f":"IF(AU76<=3,\"\",1+SUMPRODUCT(($C$76:$BJ$76>3)*(AU33<$C$33:$BJ$33))+COUNTIF($C$33:AU33,AU33)-1)","v":""},{"$f":"IF(AV76<=3,\"\",1+SUMPRODUCT(($C$76:$BJ$76>3)*(AV33<$C$33:$BJ$33))+COUNTIF($C$33:AV33,AV33)-1)","v":""},{"$f":"IF(AW76<=3,\"\",1+SUMPRODUCT(($C$76:$BJ$76>3)*(AW33<$C$33:$BJ$33))+COUNTIF($C$33:AW33,AW33)-1)","v":""},{"$f":"IF(AX76<=3,\"\",1+SUMPRODUCT(($C$76:$BJ$76>3)*(AX33<$C$33:$BJ$33))+COUNTIF($C$33:AX33,AX33)-1)","v":""},{"$f":"IF(AY76<=3,\"\",1+SUMPRODUCT(($C$76:$BJ$76>3)*(AY33<$C$33:$BJ$33)))","v":""},"","","","","","","",{"$f":"IF(BG76<=3,\"\",1+SUMPRODUCT(($C$76:$BJ$76>3)*(BG33<$C$33:$BJ$33)))","v":""},{"$f":"IF(BH76<=3,\"\",1+SUMPRODUCT(($C$76:$BJ$76>3)*(BH33<$C$33:$BJ$33)))","v":""},"",""]
["Class",null,{"$f":"IF(C77=\"\",\"\",ClassFromRank(C77,Number_of_Classes,Number_of_Contestants))","v":4},{"$f":"IF(D77=\"\",\"\",ClassFromRank(D77,Number_of_Classes,Number_of_Contestants))","v":""},{"$f":"IF(E77=\"\",\"\",ClassFromRank(E77,Number_of_Classes,Number_of_Contestants))","v":1},{"$f":"IF(F77=\"\",\"\",ClassFromRank(F77,Number_of_Classes,Number_of_Contestants))","v":""},{"$f":"IF(G77=\"\",\"\",ClassFromRank(G77,Number_of_Classes,Number_of_Contestants))","v":""},{"$f":"IF(H77=\"\",\"\",ClassFromRank(H77,Number_of_Classes,Number_of_Contestants))","v":5},{"$f":"IF(I77=\"\",\"\",ClassFromRank(I77,Number_of_Classes,Number_of_Contestants))","v":""},{"$f":"IF(J77=\"\",\"\",ClassFromRank(J77,Number_of_Classes,Number_of_Contestants))","v":3},{"$f":"IF(K77=\"\",\"\",ClassFromRank(K77,Number_of_Classes,Number_of_Contestants))","v":5},{"$f":"IF(L77=\"\",\"\",ClassFromRank(L77,Number_of_Classes,Number_of_Contestants))","v":2},{"$f":"IF(M77=\"\",\"\",ClassFromRank(M77,Number_of_Classes,Number_of_Contestants))","v":""},{"$f":"IF(N77=\"\",\"\",ClassFromRank(N77,Number_of_Classes,Number_of_Contestants))","v":""},{"$f":"IF(O77=\"\",\"\",ClassFromRank(O77,Number_of_Classes,Number_of_Contestants))","v":""},{"$f":"IF(P77=\"\",\"\",ClassFromRank(P77,Number_of_Classes,Number_of_Contestants))","v":""},{"$f":"IF(Q77=\"\",\"\",ClassFromRank(Q77,Number_of_Classes,Number_of_Contestants))","v":""},{"$f":"IF(R77=\"\",\"\",ClassFromRank(R77,Number_of_Classes,Number_of_Contestants))","v":""},{"$f":"IF(S77=\"\",\"\",ClassFromRank(S77,Number_of_Classes,Number_of_Contestants))","v":""},{"$f":"IF(T77=\"\",\"\",ClassFromRank(T77,Number_of_Classes,Number_of_Contestants))","v":""},{"$f":"IF(U77=\"\",\"\",ClassFromRank(U77,Number_of_Classes,Number_of_Contestants))","v":""},{"$f":"IF(V77=\"\",\"\",ClassFromRank(V77,Number_of_Classes,Number_of_Contestants))","v":""},{"$f":"IF(W77=\"\",\"\",ClassFromRank(W77,Number_of_Classes,Number_of_Contestants))","v":""},{"$f":"IF(X77=\"\",\"\",ClassFromRank(X77,Number_of_Classes,Number_of_Contestants))","v":""},{"$f":"IF(Y77=\"\",\"\",ClassFromRank(Y77,Number_of_Classes,Number_of_Contestants))","v":""},{"$f":"IF(Z77=\"\",\"\",ClassFromRank(Z77,Number_of_Classes,Number_of_Contestants))","v":""},{"$f":"IF(AA77=\"\",\"\",ClassFromRank(AA77,Number_of_Classes,Number_of_Contestants))","v":""},{"$f":"IF(AB77=\"\",\"\",ClassFromRank(AB77,Number_of_Classes,Number_of_Contestants))","v":""},{"$f":"IF(AC77=\"\",\"\",ClassFromRank(AC77,Number_of_Classes,Number_of_Contestants))","v":""},{"$f":"IF(AD77=\"\",\"\",ClassFromRank(AD77,Number_of_Classes,Number_of_Contestants))","v":""},{"$f":"IF(AE77=\"\",\"\",ClassFromRank(AE77,Number_of_Classes,Number_of_Contestants))","v":""},{"$f":"IF(AF77=\"\",\"\",ClassFromRank(AF77,Number_of_Classes,Number_of_Contestants))","v":""},{"$f":"IF(AG77=\"\",\"\",ClassFromRank(AG77,Number_of_Classes,Number_of_Contestants))","v":""},{"$f":"IF(AH77=\"\",\"\",ClassFromRank(AH77,Number_of_Classes,Number_of_Contestants))","v":""},{"$f":"IF(AI77=\"\",\"\",ClassFromRank(AI77,Number_of_Classes,Number_of_Contestants))","v":""},{"$f":"IF(AJ77=\"\",\"\",ClassFromRank(AJ77,Number_of_Classes,Number_of_Contestants))","v":""},{"$f":"IF(AK77=\"\",\"\",ClassFromRank(AK77,Number_of_Classes,Number_of_Contestants))","v":""},{"$f":"IF(AL77=\"\",\"\",ClassFromRank(AL77,Number_of_Classes,Number_of_Contestants))","v":""},{"$f":"IF(AM77=\"\",\"\",ClassFromRank(AM77,Number_of_Classes,Number_of_Contestants))","v":""},{"$f":"IF(AN77=\"\",\"\",ClassFromRank(AN77,Number_of_Classes,Number_of_Contestants))","v":""},{"$f":"IF(AO77=\"\",\"\",ClassFromRank(AO77,Number_of_Classes,Number_of_Contestants))","v":""},{"$f":"IF(AP77=\"\",\"\",ClassFromRank(AP77,Number_of_Classes,Number_of_Contestants))","v":""},{"$f":"IF(AQ77=\"\",\"\",ClassFromRank(AQ77,Number_of_Classes,Number_of_Contestants))","v":""},{"$f":"IF(AR77=\"\",\"\",ClassFromRank(AR77,Number_of_Classes,Number_of_Contestants))","v":""},{"$f":"IF(AS77=\"\",\"\",ClassFromRank(AS77,Number_of_Classes,Number_of_Contestants))","v":""},{"$f":"IF(AT77=\"\",\"\",ClassFromRank(AT77,Number_of_Classes,Number_of_Contestants))","v":""},{"$f":"IF(AU77=\"\",\"\",ClassFromRank(AU77,Number_of_Classes,Number_of_Contestants))","v":""},{"$f":"IF(AV77=\"\",\"\",ClassFromRank(AV77,Number_of_Classes,Number_of_Contestants))","v":""},{"$f":"IF(AW77=\"\",\"\",ClassFromRank(AW77,Number_of_Classes,Number_of_Contestants))","v":""},{"$f":"IF(AX77=\"\",\"\",ClassFromRank(AX77,Number_of_Classes,Number_of_Contestants))","v":""},{"$f":"IF(AY77=\"\",\"\",ROUNDUP(AY77/Class_Divisor,0))","v":""},"","","","","","","",{"$f":"IF(BG77=\"\",\"\",ROUNDUP(BG77/Class_Divisor,0))","v":""},"","",""]
["Rank within Class",null,{"$f":"IF(C78=\"\",\"\",1+SUMPRODUCT(($C$78:$BJ$78=C78)*($C$75:$BJ$75<C75))+COUNTIF($C$75:C75,C75)-1)","v":1},{"$f":"IF(D78=\"\",\"\",1+SUMPRODUCT(($C$78:$BJ$78=D78)*($C$75:$BJ$75<D75))+COUNTIF($C$75:D75,D75)-1)","v":""},{"$f":"IF(E78=\"\",\"\",1+SUMPRODUCT(($C$78:$BJ$78=E78)*($C$75:$BJ$75<E75))+COUNTIF($C$75:E75,E75)-1)","v":1},{"$f":"IF(F78=\"\",\"\",1+SUMPRODUCT(($C$78:$BJ$78=F78)*($C$75:$BJ$75<F75))+COUNTIF($C$75:F75,F75)-1)","v":""},{"$f":"IF(G78=\"\",\"\",1+SUMPRODUCT(($C$78:$BJ$78=G78)*($C$75:$BJ$75<G75))+COUNTIF($C$75:G75,G75)-1)","v":""},{"$f":"IF(H78=\"\",\"\",1+SUMPRODUCT(($C$78:$BJ$78=H78)*($C$75:$BJ$75<H75))+COUNTIF($C$75:H75,H75)-1)","v":2},{"$f":"IF(I78=\"\",\"\",1+SUMPRODUCT(($C$78:$BJ$78=I78)*($C$75:$BJ$75<I75))+COUNTIF($C$75:I75,I75)-1)","v":""},{"$f":"IF(J78=\"\",\"\",1+SUMPRODUCT(($C$78:$BJ$78=J78)*($C$75:$BJ$75<J75))+COUNTIF($C$75:J75,J75)-1)","v":1},{"$f":"IF(K78=\"\",\"\",1+SUMPRODUCT(($C$78:$BJ$78=K78)*($C$75:$BJ$75<K75))+COUNTIF($C$75:K75,K75)-1)","v":1},{"$f":"IF(L78=\"\",\"\",1+SUMPRODUCT(($C$78:$BJ$78=L78)*($C$75:$BJ$75<L75))+COUNTIF($C$75:L75,L75)-1)","v":1},{"$f":"IF(M78=\"\",\"\",1+SUMPRODUCT(($C$78:$BJ$78=M78)*($C$75:$BJ$75<M75))+COUNTIF($C$75:M75,M75)-1)","v":""},{"$f":"IF(N78=\"\",\"\",1+SUMPRODUCT(($C$78:$BJ$78=N78)*($C$75:$BJ$75<N75))+COUNTIF($C$75:N75,N75)-1)","v":""},{"$f":"IF(O78=\"\",\"\",1+SUMPRODUCT(($C$78:$BJ$78=O78)*($C$75:$BJ$75<O75))+COUNTIF($C$75:O75,O75)-1)","v":""},{"$f":"IF(P78=\"\",\"\",1+SUMPRODUCT(($C$78:$BJ$78=P78)*($C$75:$BJ$75<P75))+COUNTIF($C$75:P75,P75)-1)","v":""},{"$f":"IF(Q78=\"\",\"\",1+SUMPRODUCT(($C$78:$BJ$78=Q78)*($C$75:$BJ$75<Q75))+COUNTIF($C$75:Q75,Q75)-1)","v":""},{"$f":"IF(R78=\"\",\"\",1+SUMPRODUCT(($C$78:$BJ$78=R78)*($C$75:$BJ$75<R75))+COUNTIF($C$75:R75,R75)-1)","v":""},{"$f":"IF(S78=\"\",\"\",1+SUMPRODUCT(($C$78:$BJ$78=S78)*($C$75:$BJ$75<S75))+COUNTIF($C$75:S75,S75)-1)","v":""},{"$f":"IF(T78=\"\",\"\",1+SUMPRODUCT(($C$78:$BJ$78=T78)*($C$75:$BJ$75<T75))+COUNTIF($C$75:T75,T75)-1)","v":""},{"$f":"IF(U78=\"\",\"\",1+SUMPRODUCT(($C$78:$BJ$78=U78)*($C$75:$BJ$75<U75))+COUNTIF($C$75:U75,U75)-1)","v":""},{"$f":"IF(V78=\"\",\"\",1+SUMPRODUCT(($C$78:$BJ$78=V78)*($C$75:$BJ$75<V75))+COUNTIF($C$75:V75,V75)-1)","v":""},{"$f":"IF(W78=\"\",\"\",1+SUMPRODUCT(($C$78:$BJ$78=W78)*($C$75:$BJ$75<W75))+COUNTIF($C$75:W75,W75)-1)","v":""},{"$f":"IF(X78=\"\",\"\",1+SUMPRODUCT(($C$78:$BJ$78=X78)*($C$75:$BJ$75<X75))+COUNTIF($C$75:X75,X75)-1)","v":""},{"$f":"IF(Y78=\"\",\"\",1+SUMPRODUCT(($C$78:$BJ$78=Y78)*($C$75:$BJ$75<Y75))+COUNTIF($C$75:Y75,Y75)-1)","v":""},{"$f":"IF(Z78=\"\",\"\",1+SUMPRODUCT(($C$78:$BJ$78=Z78)*($C$75:$BJ$75<Z75))+COUNTIF($C$75:Z75,Z75)-1)","v":""},{"$f":"IF(AA78=\"\",\"\",1+SUMPRODUCT(($C$78:$BJ$78=AA78)*($C$75:$BJ$75<AA75))+COUNTIF($C$75:AA75,AA75)-1)","v":""},{"$f":"IF(AB78=\"\",\"\",1+SUMPRODUCT(($C$78:$BJ$78=AB78)*($C$75:$BJ$75<AB75))+COUNTIF($C$75:AB75,AB75)-1)","v":""},{"$f":"IF(AC78=\"\",\"\",1+SUMPRODUCT(($C$78:$BJ$78=AC78)*($C$75:$BJ$75<AC75))+COUNTIF($C$75:AC75,AC75)-1)","v":""},{"$f":"IF(AD78=\"\",\"\",1+SUMPRODUCT(($C$78:$BJ$78=AD78)*($C$75:$BJ$75<AD75))+COUNTIF($C$75:AD75,AD75)-1)","v":""},{"$f":"IF(AE78=\"\",\"\",1+SUMPRODUCT(($C$78:$BJ$78=AE78)*($C$75:$BJ$75<AE75))+COUNTIF($C$75:AE75,AE75)-1)","v":""},{"$f":"IF(AF78=\"\",\"\",1+SUMPRODUCT(($C$78:$BJ$78=AF78)*($C$75:$BJ$75<AF75))+COUNTIF($C$75:AF75,AF75)-1)","v":""},{"$f":"IF(AG78=\"\",\"\",1+SUMPRODUCT(($C$78:$BJ$78=AG78)*($C$75:$BJ$75<AG75))+COUNTIF($C$75:AG75,AG75)-1)","v":""},{"$f":"IF(AH78=\"\",\"\",1+SUMPRODUCT(($C$78:$BJ$78=AH78)*($C$75:$BJ$75<AH75))+COUNTIF($C$75:AH75,AH75)-1)","v":""},{"$f":"IF(AI78=\"\",\"\",1+SUMPRODUCT(($C$78:$BJ$78=AI78)*($C$75:$BJ$75<AI75))+COUNTIF($C$75:AI75,AI75)-1)","v":""},{"$f":"IF(AJ78=\"\",\"\",1+SUMPRODUCT(($C$78:$BJ$78=AJ78)*($C$75:$BJ$75<AJ75))+COUNTIF($C$75:AJ75,AJ75)-1)","v":""},{"$f":"IF(AK78=\"\",\"\",1+SUMPRODUCT(($C$78:$BJ$78=AK78)*($C$75:$BJ$75<AK75))+COUNTIF($C$75:AK75,AK75)-1)","v":""},{"$f":"IF(AL78=\"\",\"\",1+SUMPRODUCT(($C$78:$BJ$78=AL78)*($C$75:$BJ$75<AL75))+COUNTIF($C$75:AL75,AL75)-1)","v":""},{"$f":"IF(AM78=\"\",\"\",1+SUMPRODUCT(($C$78:$BJ$78=AM78)*($C$75:$BJ$75<AM75))+COUNTIF($C$75:AM75,AM75)-1)","v":""},{"$f":"IF(AN78=\"\",\"\",1+SUMPRODUCT(($C$78:$BJ$78=AN78)*($C$75:$BJ$75<AN75))+COUNTIF($C$75:AN75,AN75)-1)","v":""},{"$f":"IF(AO78=\"\",\"\",1+SUMPRODUCT(($C$78:$BJ$78=AO78)*($C$75:$BJ$75<AO75))+COUNTIF($C$75:AO75,AO75)-1)","v":""},{"$f":"IF(AP78=\"\",\"\",1+SUMPRODUCT(($C$78:$BJ$78=AP78)*($C$75:$BJ$75<AP75))+COUNTIF($C$75:AP75,AP75)-1)","v":""},{"$f":"IF(AQ78=\"\",\"\",1+SUMPRODUCT(($C$78:$BJ$78=AQ78)*($C$75:$BJ$75<AQ75))+COUNTIF($C$75:AQ75,AQ75)-1)","v":""},{"$f":"IF(AR78=\"\",\"\",1+SUMPRODUCT(($C$78:$BJ$78=AR78)*($C$75:$BJ$75<AR75))+COUNTIF($C$75:AR75,AR75)-1)","v":""},{"$f":"IF(AS78=\"\",\"\",1+SUMPRODUCT(($C$78:$BJ$78=AS78)*($C$75:$BJ$75<AS75))+COUNTIF($C$75:AS75,AS75)-1)","v":""},{"$f":"IF(AT78=\"\",\"\",1+SUMPRODUCT(($C$78:$BJ$78=AT78)*($C$75:$BJ$75<AT75))+COUNTIF($C$75:AT75,AT75)-1)","v":""},{"$f":"IF(AU78=\"\",\"\",1+SUMPRODUCT(($C$78:$BJ$78=AU78)*($C$75:$BJ$75<AU75))+COUNTIF($C$75:AU75,AU75)-1)","v":""},{"$f":"IF(AV78=\"\",\"\",1+SUMPRODUCT(($C$78:$BJ$78=AV78)*($C$75:$BJ$75<AV75))+COUNTIF($C$75:AV75,AV75)-1)","v":""},{"$f":"IF(AW78=\"\",\"\",1+SUMPRODUCT(($C$78:$BJ$78=AW78)*($C$75:$BJ$75<AW75))+COUNTIF($C$75:AW75,AW75)-1)","v":""},{"$f":"IF(AX78=\"\",\"\",1+SUMPRODUCT(($C$78:$BJ$78=AX78)*($C$75:$BJ$75<AX75))+COUNTIF($C$75:AX75,AX75)-1)","v":""}]
["Combined Class & Rank",null,{"$f":"IF(C77=\"\",\"\",C78+C79/10)","v":4.0999999999999996},{"$f":"IF(D77=\"\",\"\",D78+D79/10)","v":""},1.1000000000000001,"","",5.2,"",3.1,5.0999999999999996,2.1,{"$f":"IF(M77=\"\",\"\",M78+M79/10)","v":""},{"$f":"IF(N77=\"\",\"\",N78+N79/10)","v":""},{"$f":"IF(O77=\"\",\"\",O78+O79/10)","v":""},{"$f":"IF(P77=\"\",\"\",P78+P79/10)","v":""},{"$f":"IF(Q77=\"\",\"\",Q78+Q79/10)","v":""},{"$f":"IF(R77=\"\",\"\",R78+R79/10)","v":""},{"$f":"IF(S77=\"\",\"\",S78+S79/10)","v":""},{"$f":"IF(T77=\"\",\"\",T78+T79/10)","v":""},"",{"$f":"IF(V77=\"\",\"\",V78+V79/10)","v":""},{"$f":"IF(W77=\"\",\"\",W78+W79/10)","v":""},{"$f":"IF(X77=\"\",\"\",X78+X79/10)","v":""},{"$f":"IF(Y77=\"\",\"\",Y78+Y79/10)","v":""},{"$f":"IF(Z77=\"\",\"\",Z78+Z79/10)","v":""},{"$f":"IF(AA77=\"\",\"\",AA78+AA79/10)","v":""},{"$f":"IF(AB77=\"\",\"\",AB78+AB79/10)","v":""},{"$f":"IF(AC77=\"\",\"\",AC78+AC79/10)","v":""},"",{"$f":"IF(AE77=\"\",\"\",AE78+AE79/10)","v":""},{"$f":"IF(AF77=\"\",\"\",AF78+AF79/10)","v":""},{"$f":"IF(AG77=\"\",\"\",AG78+AG79/10)","v":""},{"$f":"IF(AH77=\"\",\"\",AH78+AH79/10)","v":""},{"$f":"IF(AI77=\"\",\"\",AI78+AI79/10)","v":""},{"$f":"IF(AJ77=\"\",\"\",AJ78+AJ79/10)","v":""},{"$f":"IF(AK77=\"\",\"\",AK78+AK79/10)","v":""},{"$f":"IF(AL77=\"\",\"\",AL78+AL79/10)","v":""},"",{"$f":"IF(AN77=\"\",\"\",AN78+AN79/10)","v":""},{"$f":"IF(AO77=\"\",\"\",AO78+AO79/10)","v":""},{"$f":"IF(AP77=\"\",\"\",AP78+AP79/10)","v":""},{"$f":"IF(AQ77=\"\",\"\",AQ78+AQ79/10)","v":""},{"$f":"IF(AR77=\"\",\"\",AR78+AR79/10)","v":""},{"$f":"IF(AS77=\"\",\"\",AS78+AS79/10)","v":""},{"$f":"IF(AT77=\"\",\"\",AT78+AT79/10)","v":""},{"$f":"IF(AU77=\"\",\"\",AU78+AU79/10)","v":""},"",{"$f":"IF(AW77=\"\",\"\",AW78+AW79/10)","v":""},{"$f":"IF(AX77=\"\",\"\",AX78+AX79/10)","v":""},{"$f":"IF(AY77=\"\",\"\",AY78+AY79/10)","v":""},{"$f":"IF(AZ77=\"\",\"\",AZ78+AZ79/10)","v":""},{"$f":"IF(BA77=\"\",\"\",BA78+BA79/10)","v":""},{"$f":"IF(BB77=\"\",\"\",BB78+BB79/10)","v":""},{"$f":"IF(BC77=\"\",\"\",BC78+BC79/10)","v":""},{"$f":"IF(BD77=\"\",\"\",BD78+BD79/10)","v":""},"",{"$f":"IF(BF77=\"\",\"\",BF78+BF79/10)","v":""},"","",{"$f":"IF(BI77=\"\",\"\",BI78+BI79/10)","v":""},{"$f":"IF(BJ77=\"\",\"\",BJ78+BJ79/10)","v":""}]
["Novice Rank",null,{"$f":"IF(C11=\"Yes\",1+SUMPRODUCT(($C$11:$BJ$11=\"Yes\")*(C75>$C$75:$BJ$75)),\"\")","v":""},"","","","","","","","",1,"","","","","","","","","","","","","","","","","","","","","","",{"$f":"IF(AI11=\"Yes\",1+SUMPRODUCT(($C$11:$BJ$11=\"Yes\")*(AI75>$C$75:$BJ$75)),\"\")","v":""},"","","","","","","","","","","","","","","","","","","","","","","",{"$f":"IF(BG11=\"Yes\",1+SUMPRODUCT(($C$11:$BJ$11=\"Yes\")*(BG75>$C$75:$BJ$75)),\"\")","v":""},"","",""]
["Rank by Predicted Start Time",null,{"$f":"IFERROR(RANK(C22,$C$22:$BJ$22,1)+COUNTIF($C$22:C22,C22)-1,\"\")","v":7},{"$f":"IFERROR(RANK(D22,$C$22:$BJ$22,1)+COUNTIF($C$22:D22,D22)-1,\"\")","v":""},{"$f":"IFERROR(RANK(E22,$C$22:$BJ$22,1)+COUNTIF($C$22:E22,E22)-1,\"\")","v":1},{"$f":"IFERROR(RANK(F22,$C$22:$BJ$22,1)+COUNTIF($C$22:F22,F22)-1,\"\")","v":5},{"$f":"IFERROR(RANK(G22,$C$22:$BJ$22,1)+COUNTIF($C$22:G22,G22)-1,\"\")","v":2},{"$f":"IFERROR(RANK(H22,$C$22:$BJ$22,1)+COUNTIF($C$22:H22,H22)-1,\"\")","v":9},{"$f":"IFERROR(RANK(I22,$C$22:$BJ$22,1)+COUNTIF($C$22:I22,I22)-1,\"\")","v":4},{"$f":"IFERROR(RANK(J22,$C$22:$BJ$22,1)+COUNTIF($C$22:J22,J22)-1,\"\")","v":6},{"$f":"IFERROR(RANK(K22,$C$22:$BJ$22,1)+COUNTIF($C$22:K22,K22)-1,\"\")","v":8},{"$f":"IFERROR(RANK(L22,$C$22:$BJ$22,1)+COUNTIF($C$22:L22,L22)-1,\"\")","v":3},{"$f":"IFERROR(RANK(M22,$C$22:$BJ$22,1)+COUNTIF($C$22:M22,M22)-1,\"\")","v":""},{"$f":"IFERROR(RANK(N22,$C$22:$BJ$22,1)+COUNTIF($C$22:N22,N22)-1,\"\")","v":""},{"$f":"IFERROR(RANK(O22,$C$22:$BJ$22,1)+COUNTIF($C$22:O22,O22)-1,\"\")","v":""},{"$f":"IFERROR(RANK(P22,$C$22:$BJ$22,1)+COUNTIF($C$22:P22,P22)-1,\"\")","v":""},{"$f":"IFERROR(RANK(Q22,$C$22:$BJ$22,1)+COUNTIF($C$22:Q22,Q22)-1,\"\")","v":""},{"$f":"IFERROR(RANK(R22,$C$22:$BJ$22,1)+COUNTIF($C$22:R22,R22)-1,\"\")","v":""},{"$f":"IFERROR(RANK(S22,$C$22:$BJ$22,1)+COUNTIF($C$22:S22,S22)-1,\"\")","v":""},{"$f":"IFERROR(RANK(T22,$C$22:$BJ$22,1)+COUNTIF($C$22:T22,T22)-1,\"\")","v":""},{"$f":"IFERROR(RANK(U22,$C$22:$BJ$22,1)+COUNTIF($C$22:U22,U22)-1,\"\")","v":""},{"$f":"IFERROR(RANK(V22,$C$22:$BJ$22,1)+COUNTIF($C$22:V22,V22)-1,\"\")","v":""},{"$f":"IFERROR(RANK(W22,$C$22:$BJ$22,1)+COUNTIF($C$22:W22,W22)-1,\"\")","v":""},{"$f":"IFERROR(RANK(X22,$C$22:$BJ$22,1)+COUNTIF($C$22:X22,X22)-1,\"\")","v":""},{"$f":"IFERROR(RANK(Y22,$C$22:$BJ$22,1)+COUNTIF($C$22:Y22,Y22)-1,\"\")","v":""},{"$f":"IFERROR(RANK(Z22,$C$22:$BJ$22,1)+COUNTIF($C$22:Z22,Z22)-1,\"\")","v":""},{"$f":"IFERROR(RANK(AA22,$C$22:$BJ$22,1)+COUNTIF($C$22:AA22,AA22)-1,\"\")","v":""},{"$f":"IFERROR(RANK(AB22,$C$22:$BJ$22,1)+COUNTIF($C$22:AB22,AB22)-1,\"\")","v":""},{"$f":"IFERROR(RANK(AC22,$C$22:$BJ$22,1)+COUNTIF($C$22:AC22,AC22)-1,\"\")","v":""},{"$f":"IFERROR(RANK(AD22,$C$22:$BJ$22,1)+COUNTIF($C$22:AD22,AD22)-1,\"\")","v":""},{"$f":"IFERROR(RANK(AE22,$C$22:$BJ$22,1)+COUNTIF($C$22:AE22,AE22)-1,\"\")","v":""},{"$f":"IFERROR(RANK(AF22,$C$22:$BJ$22,1)+COUNTIF($C$22:AF22,AF22)-1,\"\")","v":""},{"$f":"IFERROR(RANK(AG22,$C$22:$BJ$22,1)+COUNTIF($C$22:AG22,AG22)-1,\"\")","v":""},{"$f":"IFERROR(RANK(AH22,$C$22:$BJ$22,1)+COUNTIF($C$22:AH22,AH22)-1,\"\")","v":""},{"$f":"IFERROR(RANK(AI22,$C$22:$BJ$22,1)+COUNTIF($C$22:AI22,AI22)-1,\"\")","v":""},{"$f":"IFERROR(RANK(AJ22,$C$22:$BJ$22,1)+COUNTIF($C$22:AJ22,AJ22)-1,\"\")","v":""},{"$f":"IFERROR(RANK(AK22,$C$22:$BJ$22,1)+COUNTIF($C$22:AK22,AK22)-1,\"\")","v":""},{"$f":"IFERROR(RANK(AL22,$C$22:$BJ$22,1)+COUNTIF($C$22:AL22,AL22)-1,\"\")","v":""},{"$f":"IFERROR(RANK(AM22,$C$22:$BJ$22,1)+COUNTIF($C$22:AM22,AM22)-1,\"\")","v":""},{"$f":"IFERROR(RANK(AN22,$C$22:$BJ$22,1)+COUNTIF($C$22:AN22,AN22)-1,\"\")","v":""},{"$f":"IFERROR(RANK(AO22,$C$22:$BJ$22,1)+COUNTIF($C$22:AO22,AO22)-1,\"\")","v":""},{"$f":"IFERROR(RANK(AP22,$C$22:$BJ$22,1)+COUNTIF($C$22:AP22,AP22)-1,\"\")","v":""},{"$f":"IFERROR(RANK(AQ22,$C$22:$BJ$22,1)+COUNTIF($C$22:AQ22,AQ22)-1,\"\")","v":""},{"$f":"IFERROR(RANK(AR22,$C$22:$BJ$22,1)+COUNTIF($C$22:AR22,AR22)-1,\"\")","v":""},{"$f":"IFERROR(RANK(AS22,$C$22:$BJ$22,1)+COUNTIF($C$22:AS22,AS22)-1,\"\")","v":""},{"$f":"IFERROR(RANK(AT22,$C$22:$BJ$22,1)+COUNTIF($C$22:AT22,AT22)-1,\"\")","v":""},{"$f":"IFERROR(RANK(AU22,$C$22:$BJ$22,1)+COUNTIF($C$22:AU22,AU22)-1,\"\")","v":""},{"$f":"IFERROR(RANK(AV22,$C$22:$BJ$22,1)+COUNTIF($C$22:AV22,AV22)-1,\"\")","v":""},{"$f":"IFERROR(RANK(AW22,$C$22:$BJ$22,1)+COUNTIF($C$22:AW22,AW22)-1,\"\")","v":""},{"$f":"IFERROR(RANK(AX22,$C$22:$BJ$22,1)+COUNTIF($C$22:AX22,AX22)-1,\"\")","v":""},{"$f":"IFERROR(RANK(AY22,$C$22:$BJ$22,1),\"\")","v":""},"","","","","","","",{"$f":"IFERROR(RANK(BG22,$C$22:$BJ$22,1),\"\")","v":""},"","",""]
["Rank by Alpha Boat Name",null,{"$f":"COUNTIF($C$4:$AX$4,\"<\" & C4)+COUNTIF($C$4:C4,C4)","v":4},{"$f":"COUNTIF($C$4:$AX$4,\"<\" & D4)+COUNTIF($C$4:D4,D4)","v":0},{"$f":"COUNTIF($C$4:$AX$4,\"<\" & E4)+COUNTIF($C$4:E4,E4)","v":9},{"$f":"COUNTIF($C$4:$AX$4,\"<\" & F4)+COUNTIF($C$4:F4,F4)","v":1},{"$f":"COUNTIF($C$4:$AX$4,\"<\" & G4)+COUNTIF($C$4:G4,G4)","v":8},{"$f":"COUNTIF($C$4:$AX$4,\"<\" & H4)+COUNTIF($C$4:H4,H4)","v":6},{"$f":"COUNTIF($C$4:$AX$4,\"<\" & I4)+COUNTIF($C$4:I4,I4)","v":5},{"$f":"COUNTIF($C$4:$AX$4,\"<\" & J4)+COUNTIF($C$4:J4,J4)","v":3},{"$f":"COUNTIF($C$4:$AX$4,\"<\" & K4)+COUNTIF($C$4:K4,K4)","v":2},{"$f":"COUNTIF($C$4:$AX$4,\"<\" & L4)+COUNTIF($C$4:L4,L4)","v":7},{"$f":"COUNTIF($C$4:$AX$4,\"<\" & M4)+COUNTIF($C$4:M4,M4)","v":0},{"$f":"COUNTIF($C$4:$AX$4,\"<\" & N4)+COUNTIF($C$4:N4,N4)","v":0},{"$f":"COUNTIF($C$4:$AX$4,\"<\" & O4)+COUNTIF($C$4:O4,O4)","v":0},{"$f":"COUNTIF($C$4:$AX$4,\"<\" & P4)+COUNTIF($C$4:P4,P4)","v":0},{"$f":"COUNTIF($C$4:$AX$4,\"<\" & Q4)+COUNTIF($C$4:Q4,Q4)","v":0},{"$f":"COUNTIF($C$4:$AX$4,\"<\" & R4)+COUNTIF($C$4:R4,R4)","v":0},{"$f":"COUNTIF($C$4:$AX$4,\"<\" & S4)+COUNTIF($C$4:S4,S4)","v":0},{"$f":"COUNTIF($C$4:$AX$4,\"<\" & T4)+COUNTIF($C$4:T4,T4)","v":0},{"$f":"COUNTIF($C$4:$AX$4,\"<\" & U4)+COUNTIF($C$4:U4,U4)","v":0},{"$f":"COUNTIF($C$4:$AX$4,\"<\" & V4)+COUNTIF($C$4:V4,V4)","v":0},{"$f":"COUNTIF($C$4:$AX$4,\"<\" & W4)+COUNTIF($C$4:W4,W4)","v":0},{"$f":"COUNTIF($C$4:$AX$4,\"<\" & X4)+COUNTIF($C$4:X4,X4)","v":0},{"$f":"COUNTIF($C$4:$AX$4,\"<\" & Y4)+COUNTIF($C$4:Y4,Y4)","v":0},{"$f":"COUNTIF($C$4:$AX$4,\"<\" & Z4)+COUNTIF($C$4:Z4,Z4)","v":0},{"$f":"COUNTIF($C$4:$AX$4,\"<\" & AA4)+COUNTIF($C$4:AA4,AA4)","v":0},{"$f":"COUNTIF($C$4:$AX$4,\"<\" & AB4)+COUNTIF($C$4:AB4,AB4)","v":0},{"$f":"COUNTIF($C$4:$AX$4,\"<\" & AC4)+COUNTIF($C$4:AC4,AC4)","v":0},{"$f":"COUNTIF($C$4:$AX$4,\"<\" & AD4)+COUNTIF($C$4:AD4,AD4)","v":0},{"$f":"COUNTIF($C$4:$AX$4,\"<\" & AE4)+COUNTIF($C$4:AE4,AE4)","v":0},{"$f":"COUNTIF($C$4:$AX$4,\"<\" & AF4)+COUNTIF($C$4:AF4,AF4)","v":0},{"$f":"COUNTIF($C$4:$AX$4,\"<\" & AG4)+COUNTIF($C$4:AG4,AG4)","v":0},{"$f":"COUNTIF($C$4:$AX$4,\"<\" & AH4)+COUNTIF($C$4:AH4,AH4)","v":0},{"$f":"COUNTIF($C$4:$AX$4,\"<\" & AI4)+COUNTIF($C$4:AI4,AI4)","v":0},{"$f":"COUNTIF($C$4:$AX$4,\"<\" & AJ4)+COUNTIF($C$4:AJ4,AJ4)","v":0},{"$f":"COUNTIF($C$4:$AX$4,\"<\" & AK4)+COUNTIF($C$4:AK4,AK4)","v":0},{"$f":"COUNTIF($C$4:$AX$4,\"<\" & AL4)+COUNTIF($C$4:AL4,AL4)","v":0},{"$f":"COUNTIF($C$4:$AX$4,\"<\" & AM4)+COUNTIF($C$4:AM4,AM4)","v":0},{"$f":"COUNTIF($C$4:$AX$4,\"<\" & AN4)+COUNTIF($C$4:AN4,AN4)","v":0},{"$f":"COUNTIF($C$4:$AX$4,\"<\" & AO4)+COUNTIF($C$4:AO4,AO4)","v":0},{"$f":"COUNTIF($C$4:$AX$4,\"<\" & AP4)+COUNTIF($C$4:AP4,AP4)","v":0},{"$f":"COUNTIF($C$4:$AX$4,\"<\" & AQ4)+COUNTIF($C$4:AQ4,AQ4)","v":0},{"$f":"COUNTIF($C$4:$AX$4,\"<\" & AR4)+COUNTIF($C$4:AR4,AR4)","v":0},{"$f":"COUNTIF($C$4:$AX$4,\"<\" & AS4)+COUNTIF($C$4:AS4,AS4)","v":0},{"$f":"COUNTIF($C$4:$AX$4,\"<\" & AT4)+COUNTIF($C$4:AT4,AT4)","v":0},{"$f":"COUNTIF($C$4:$AX$4,\"<\" & AU4)+COUNTIF($C$4:AU4,AU4)","v":0},{"$f":"COUNTIF($C$4:$AX$4,\"<\" & AV4)+COUNTIF($C$4:AV4,AV4)","v":0},{"$f":"COUNTIF($C$4:$AX$4,\"<\" & AW4)+COUNTIF($C$4:AW4,AW4)","v":0},{"$f":"COUNTIF($C$4:$AX$4,\"<\" & AX4)+COUNTIF($C$4:AX4,AX4)","v":0},{"$f":"COUNTIF($C$4:$BJ$4,\"<\" & AY4)-COUNTBLANK($C$1:$BJ$1)+1","v":-50},-50,-50,-50,-50,-50,-50,-50,-50,-50,-50,-50]
["Combined Club & Boat",null,{"$f":"C5&\" \"&C4","v":"SYC PANACHE"}," ","MBYC SOJOURN","PYC FREEDOM","BYC SARAH B","SYC RAZZLE","BYC PEACHY KEEN","SYC MISS MIRANDA","QCYC KLETTITAT","BYC SAGA"," "," "," "," "," "," "," "," "," "," "," "," "," "," "," "," "," "," "," "," "," "," ",{"$f":"AI5&\" \"&AI4","v":" "}," "," "," "," "," "," "," "," "," "," "," "," "," "," "," "," "," "," "," "," "," "," "," "," "," "," "," "]
["Rank by Club & Boat",null,{"$f":"COUNTIF($C$84:$BJ$84,\"<\" & C84)-COUNTBLANK($C$1:$BJ$1)+1+COUNTIF($C$84:C84,C84)-1","v":8},{"$f":"COUNTIF($C$84:$BJ$84,\"<\" & D84)-COUNTBLANK($C$1:$BJ$1)+1+COUNTIF($C$84:D84,D84)-1","v":-50},{"$f":"COUNTIF($C$84:$BJ$84,\"<\" & E84)-COUNTBLANK($C$1:$BJ$1)+1+COUNTIF($C$84:E84,E84)-1","v":4},{"$f":"COUNTIF($C$84:$BJ$84,\"<\" & F84)-COUNTBLANK($C$1:$BJ$1)+1+COUNTIF($C$84:F84,F84)-1","v":5},{"$f":"COUNTIF($C$84:$BJ$84,\"<\" & G84)-COUNTBLANK($C$1:$BJ$1)+1+COUNTIF($C$84:G84,G84)-1","v":3},{"$f":"COUNTIF($C$84:$BJ$84,\"<\" & H84)-COUNTBLANK($C$1:$BJ$1)+1+COUNTIF($C$84:H84,H84)-1","v":9},{"$f":"COUNTIF($C$84:$BJ$84,\"<\" & I84)-COUNTBLANK($C$1:$BJ$1)+1+COUNTIF($C$84:I84,I84)-1","v":1},{"$f":"COUNTIF($C$84:$BJ$84,\"<\" & J84)-COUNTBLANK($C$1:$BJ$1)+1+COUNTIF($C$84:J84,J84)-1","v":7},{"$f":"COUNTIF($C$84:$BJ$84,\"<\" & K84)-COUNTBLANK($C$1:$BJ$1)+1+COUNTIF($C$84:K84,K84)-1","v":6},{"$f":"COUNTIF($C$84:$BJ$84,\"<\" & L84)-COUNTBLANK($C$1:$BJ$1)+1+COUNTIF($C$84:L84,L84)-1","v":2},{"$f":"COUNTIF($C$84:$BJ$84,\"<\" & M84)-COUNTBLANK($C$1:$BJ$1)+1+COUNTIF($C$84:M84,M84)-1","v":-49},{"$f":"COUNTIF($C$84:$BJ$84,\"<\" & N84)-COUNTBLANK($C$1:$BJ$1)+1+COUNTIF($C$84:N84,N84)-1","v":-48},{"$f":"COUNTIF($C$84:$BJ$84,\"<\" & O84)-COUNTBLANK($C$1:$BJ$1)+1+COUNTIF($C$84:O84,O84)-1","v":-47},{"$f":"COUNTIF($C$84:$BJ$84,\"<\" & P84)-COUNTBLANK($C$1:$BJ$1)+1+COUNTIF($C$84:P84,P84)-1","v":-46},{"$f":"COUNTIF($C$84:$BJ$84,\"<\" & Q84)-COUNTBLANK($C$1:$BJ$1)+1+COUNTIF($C$84:Q84,Q84)-1","v":-45},{"$f":"COUNTIF($C$84:$BJ$84,\"<\" & R84)-COUNTBLANK($C$1:$BJ$1)+1+COUNTIF($C$84:R84,R84)-1","v":-44},{"$f":"COUNTIF($C$84:$BJ$84,\"<\" & S84)-COUNTBLANK($C$1:$BJ$1)+1+COUNTIF($C$84:S84,S84)-1","v":-43},{"$f":"COUNTIF($C$84:$BJ$84,\"<\" & T84)-COUNTBLANK($C$1:$BJ$1)+1+COUNTIF($C$84:T84,T84)-1","v":-42},{"$f":"COUNTIF($C$84:$BJ$84,\"<\" & U84)-COUNTBLANK($C$1:$BJ$1)+1+COUNTIF($C$84:U84,U84)-1","v":-41},{"$f":"COUNTIF($C$84:$BJ$84,\"<\" & V84)-COUNTBLANK($C$1:$BJ$1)+1+COUNTIF($C$84:V84,V84)-1","v":-40},{"$f":"COUNTIF($C$84:$BJ$84,\"<\" & W84)-COUNTBLANK($C$1:$BJ$1)+1+COUNTIF($C$84:W84,W84)-1","v":-39},{"$f":"COUNTIF($C$84:$BJ$84,\"<\" & X84)-COUNTBLANK($C$1:$BJ$1)+1+COUNTIF($C$84:X84,X84)-1","v":-38},{"$f":"COUNTIF($C$84:$BJ$84,\"<\" & Y84)-COUNTBLANK($C$1:$BJ$1)+1+COUNTIF($C$84:Y84,Y84)-1","v":-37},{"$f":"COUNTIF($C$84:$BJ$84,\"<\" & Z84)-COUNTBLANK($C$1:$BJ$1)+1+COUNTIF($C$84:Z84,Z84)-1","v":-36},{"$f":"COUNTIF($C$84:$BJ$84,\"<\" & AA84)-COUNTBLANK($C$1:$BJ$1)+1+COUNTIF($C$84:AA84,AA84)-1","v":-35},{"$f":"COUNTIF($C$84:$BJ$84,\"<\" & AB84)-COUNTBLANK($C$1:$BJ$1)+1+COUNTIF($C$84:AB84,AB84)-1","v":-34},{"$f":"COUNTIF($C$84:$BJ$84,\"<\" & AC84)-COUNTBLANK($C$1:$BJ$1)+1+COUNTIF($C$84:AC84,AC84)-1","v":-33},{"$f":"COUNTIF($C$84:$BJ$84,\"<\" & AD84)-COUNTBLANK($C$1:$BJ$1)+1+COUNTIF($C$84:AD84,AD84)-1","v":-32},{"$f":"COUNTIF($C$84:$BJ$84,\"<\" & AE84)-COUNTBLANK($C$1:$BJ$1)+1+COUNTIF($C$84:AE84,AE84)-1","v":-31},{"$f":"COUNTIF($C$84:$BJ$84,\"<\" & AF84)-COUNTBLANK($C$1:$BJ$1)+1+COUNTIF($C$84:AF84,AF84)-1","v":-30},{"$f":"COUNTIF($C$84:$BJ$84,\"<\" & AG84)-COUNTBLANK($C$1:$BJ$1)+1+COUNTIF($C$84:AG84,AG84)-1","v":-29},{"$f":"COUNTIF($C$84:$BJ$84,\"<\" & AH84)-COUNTBLANK($C$1:$BJ$1)+1+COUNTIF($C$84:AH84,AH84)-1","v":-28},{"$f":"COUNTIF($C$84:$BJ$84,\"<\" & AI84)-COUNTBLANK($C$1:$BJ$1)+1+COUNTIF($C$84:AI84,AI84)-1","v":-27},{"$f":"COUNTIF($C$84:$BJ$84,\"<\" & AJ84)-COUNTBLANK($C$1:$BJ$1)+1+COUNTIF($C$84:AJ84,AJ84)-1","v":-26},{"$f":"COUNTIF($C$84:$BJ$84,\"<\" & AK84)-COUNTBLANK($C$1:$BJ$1)+1+COUNTIF($C$84:AK84,AK84)-1","v":-25},{"$f":"COUNTIF($C$84:$BJ$84,\"<\" & AL84)-COUNTBLANK($C$1:$BJ$1)+1+COUNTIF($C$84:AL84,AL84)-1","v":-24},{"$f":"COUNTIF($C$84:$BJ$84,\"<\" & AM84)-COUNTBLANK($C$1:$BJ$1)+1+COUNTIF($C$84:AM84,AM84)-1","v":-23},{"$f":"COUNTIF($C$84:$BJ$84,\"<\" & AN84)-COUNTBLANK($C$1:$BJ$1)+1+COUNTIF($C$84:AN84,AN84)-1","v":-22},{"$f":"COUNTIF($C$84:$BJ$84,\"<\" & AO84)-COUNTBLANK($C$1:$BJ$1)+1+COUNTIF($C$84:AO84,AO84)-1","v":-21},{"$f":"COUNTIF($C$84:$BJ$84,\"<\" & AP84)-COUNTBLANK($C$1:$BJ$1)+1+COUNTIF($C$84:AP84,AP84)-1","v":-20},{"$f":"COUNTIF($C$84:$BJ$84,\"<\" & AQ84)-COUNTBLANK($C$1:$BJ$1)+1+COUNTIF($C$84:AQ84,AQ84)-1","v":-19},{"$f":"COUNTIF($C$84:$BJ$84,\"<\" & AR84)-COUNTBLANK($C$1:$BJ$1)+1+COUNTIF($C$84:AR84,AR84)-1","v":-18},{"$f":"COUNTIF($C$84:$BJ$84,\"<\" & AS84)-COUNTBLANK($C$1:$BJ$1)+1+COUNTIF($C$84:AS84,AS84)-1","v":-17},{"$f":"COUNTIF($C$84:$BJ$84,\"<\" & AT84)-COUNTBLANK($C$1:$BJ$1)+1+COUNTIF($C$84:AT84,AT84)-1","v":-16},{"$f":"COUNTIF($C$84:$BJ$84,\"<\" & AU84)-COUNTBLANK($C$1:$BJ$1)+1+COUNTIF($C$84:AU84,AU84)-1","v":-15},{"$f":"COUNTIF($C$84:$BJ$84,\"<\" & AV84)-COUNTBLANK($C$1:$BJ$1)+1+COUNTIF($C$84:AV84,AV84)-1","v":-14},{"$f":"COUNTIF($C$84:$BJ$84,\"<\" & AW84)-COUNTBLANK($C$1:$BJ$1)+1+COUNTIF($C$84:AW84,AW84)-1","v":-13},{"$f":"COUNTIF($C$84:$BJ$84,\"<\" & AX84)-COUNTBLANK($C$1:$BJ$1)+1+COUNTIF($C$84:AX84,AX84)-1","v":-12},{"$f":"COUNTIF($C$84:$BJ$84,\"<\" & AY84)-COUNTBLANK($C$1:$BJ$1)+1","v":-50},-50,-50,-50,-50,-50,-50,-50,-50,-50,-50,-50]
["Combined Club & Error",null,{"$f":"C5&\" \"&TEXT(C75,\"0.0000%\")","v":"SYC 1.1920%"}," 0.0000%","MBYC 1.0173%","PYC 0.1616%","BYC 0.3175%","SYC 2.6682%","BYC 0.4194%","SYC 0.6424%","QCYC 1.0157%","BYC 1.1578%"," 0.0000%"," 0.0000%"," 0.0000%"," 0.0000%"," 0.0000%"," 0.0000%"," 0.0000%"," 0.0000%"," 0.0000%"," 0.0000%"," 0.0000%"," 0.0000%"," 0.0000%"," 0.0000%"," 0.0000%"," 0.0000%"," 0.0000%"," 0.0000%"," 0.0000%"," 0.0000%"," 0.0000%"," 0.0000%",{"$f":"AI5&\" \"&TEXT(AI75,\"0.0000%\")","v":" 0.0000%"}," 0.0000%"," 0.0000%"," 0.0000%"," 0.0000%"," 0.0000%"," 0.0000%"," 0.0000%"," 0.0000%"," 0.0000%"," 0.0000%"," 0.0000%"," 0.0000%"," 0.0000%"," 0.0000%"," 0.0000%"," 0.0000%"," 0.0000%"," 0.0000%"," 0.0000%"," 0.0000%"," 0.0000%"," 0.0000%"," 0.0000%"," 0.0000%"," 0.0000%"," 0.0000%"," 0.0000%"]
["Rank by Club & Error",null,{"$f":"COUNTIF($C$86:$BJ$86,\"<\" & C86)-COUNTBLANK($C$1:$BJ$1)+1+COUNTIF($C$86:C86,C86)-1","v":8},{"$f":"COUNTIF($C$86:$BJ$86,\"<\" & D86)-COUNTBLANK($C$1:$BJ$1)+1+COUNTIF($C$86:D86,D86)-1","v":-50},{"$f":"COUNTIF($C$86:$BJ$86,\"<\" & E86)-COUNTBLANK($C$1:$BJ$1)+1+COUNTIF($C$86:E86,E86)-1","v":4},{"$f":"COUNTIF($C$86:$BJ$86,\"<\" & F86)-COUNTBLANK($C$1:$BJ$1)+1+COUNTIF($C$86:F86,F86)-1","v":5},{"$f":"COUNTIF($C$86:$BJ$86,\"<\" & G86)-COUNTBLANK($C$1:$BJ$1)+1+COUNTIF($C$86:G86,G86)-1","v":1},{"$f":"COUNTIF($C$86:$BJ$86,\"<\" & H86)-COUNTBLANK($C$1:$BJ$1)+1+COUNTIF($C$86:H86,H86)-1","v":9},{"$f":"COUNTIF($C$86:$BJ$86,\"<\" & I86)-COUNTBLANK($C$1:$BJ$1)+1+COUNTIF($C$86:I86,I86)-1","v":2},{"$f":"COUNTIF($C$86:$BJ$86,\"<\" & J86)-COUNTBLANK($C$1:$BJ$1)+1+COUNTIF($C$86:J86,J86)-1","v":7},{"$f":"COUNTIF($C$86:$BJ$86,\"<\" & K86)-COUNTBLANK($C$1:$BJ$1)+1+COUNTIF($C$86:K86,K86)-1","v":6},{"$f":"COUNTIF($C$86:$BJ$86,\"<\" & L86)-COUNTBLANK($C$1:$BJ$1)+1+COUNTIF($C$86:L86,L86)-1","v":3},{"$f":"COUNTIF($C$86:$BJ$86,\"<\" & M86)-COUNTBLANK($C$1:$BJ$1)+1+COUNTIF($C$86:M86,M86)-1","v":-49},{"$f":"COUNTIF($C$86:$BJ$86,\"<\" & N86)-COUNTBLANK($C$1:$BJ$1)+1+COUNTIF($C$86:N86,N86)-1","v":-48},{"$f":"COUNTIF($C$86:$BJ$86,\"<\" & O86)-COUNTBLANK($C$1:$BJ$1)+1+COUNTIF($C$86:O86,O86)-1","v":-47},{"$f":"COUNTIF($C$86:$BJ$86,\"<\" & P86)-COUNTBLANK($C$1:$BJ$1)+1+COUNTIF($C$86:P86,P86)-1","v":-46},{"$f":"COUNTIF($C$86:$BJ$86,\"<\" & Q86)-COUNTBLANK($C$1:$BJ$1)+1+COUNTIF($C$86:Q86,Q86)-1","v":-45},{"$f":"COUNTIF($C$86:$BJ$86,\"<\" & R86)-COUNTBLANK($C$1:$BJ$1)+1+COUNTIF($C$86:R86,R86)-1","v":-44},{"$f":"COUNTIF($C$86:$BJ$86,\"<\" & S86)-COUNTBLANK($C$1:$BJ$1)+1+COUNTIF($C$86:S86,S86)-1","v":-43},{"$f":"COUNTIF($C$86:$BJ$86,\"<\" & T86)-COUNTBLANK($C$1:$BJ$1)+1+COUNTIF($C$86:T86,T86)-1","v":-42},{"$f":"COUNTIF($C$86:$BJ$86,\"<\" & U86)-COUNTBLANK($C$1:$BJ$1)+1+COUNTIF($C$86:U86,U86)-1","v":-41},{"$f":"COUNTIF($C$86:$BJ$86,\"<\" & V86)-COUNTBLANK($C$1:$BJ$1)+1+COUNTIF($C$86:V86,V86)-1","v":-40},{"$f":"COUNTIF($C$86:$BJ$86,\"<\" & W86)-COUNTBLANK($C$1:$BJ$1)+1+COUNTIF($C$86:W86,W86)-1","v":-39},{"$f":"COUNTIF($C$86:$BJ$86,\"<\" & X86)-COUNTBLANK($C$1:$BJ$1)+1+COUNTIF($C$86:X86,X86)-1","v":-38},{"$f":"COUNTIF($C$86:$BJ$86,\"<\" & Y86)-COUNTBLANK($C$1:$BJ$1)+1+COUNTIF($C$86:Y86,Y86)-1","v":-37},{"$f":"COUNTIF($C$86:$BJ$86,\"<\" & Z86)-COUNTBLANK($C$1:$BJ$1)+1+COUNTIF($C$86:Z86,Z86)-1","v":-36},{"$f":"COUNTIF($C$86:$BJ$86,\"<\" & AA86)-COUNTBLANK($C$1:$BJ$1)+1+COUNTIF($C$86:AA86,AA86)-1","v":-35},{"$f":"COUNTIF($C$86:$BJ$86,\"<\" & AB86)-COUNTBLANK($C$1:$BJ$1)+1+COUNTIF($C$86:AB86,AB86)-1","v":-34},{"$f":"COUNTIF($C$86:$BJ$86,\"<\" & AC86)-COUNTBLANK($C$1:$BJ$1)+1+COUNTIF($C$86:AC86,AC86)-1","v":-33},{"$f":"COUNTIF($C$86:$BJ$86,\"<\" & AD86)-COUNTBLANK($C$1:$BJ$1)+1+COUNTIF($C$86:AD86,AD86)-1","v":-32},{"$f":"COUNTIF($C$86:$BJ$86,\"<\" & AE86)-COUNTBLANK($C$1:$BJ$1)+1+COUNTIF($C$86:AE86,AE86)-1","v":-31},{"$f":"COUNTIF($C$86:$BJ$86,\"<\" & AF86)-COUNTBLANK($C$1:$BJ$1)+1+COUNTIF($C$86:AF86,AF86)-1","v":-30},{"$f":"COUNTIF($C$86:$BJ$86,\"<\" & AG86)-COUNTBLANK($C$1:$BJ$1)+1+COUNTIF($C$86:AG86,AG86)-1","v":-29},{"$f":"COUNTIF($C$86:$BJ$86,\"<\" & AH86)-COUNTBLANK($C$1:$BJ$1)+1+COUNTIF($C$86:AH86,AH86)-1","v":-28},{"$f":"COUNTIF($C$86:$BJ$86,\"<\" & AI86)-COUNTBLANK($C$1:$BJ$1)+1+COUNTIF($C$86:AI86,AI86)-1","v":-27},{"$f":"COUNTIF($C$86:$BJ$86,\"<\" & AJ86)-COUNTBLANK($C$1:$BJ$1)+1+COUNTIF($C$86:AJ86,AJ86)-1","v":-26},{"$f":"COUNTIF($C$86:$BJ$86,\"<\" & AK86)-COUNTBLANK($C$1:$BJ$1)+1+COUNTIF($C$86:AK86,AK86)-1","v":-25},{"$f":"COUNTIF($C$86:$BJ$86,\"<\" & AL86)-COUNTBLANK($C$1:$BJ$1)+1+COUNTIF($C$86:AL86,AL86)-1","v":-24},{"$f":"COUNTIF($C$86:$BJ$86,\"<\" & AM86)-COUNTBLANK($C$1:$BJ$1)+1+COUNTIF($C$86:AM86,AM86)-1","v":-23},{"$f":"COUNTIF($C$86:$BJ$86,\"<\" & AN86)-COUNTBLANK($C$1:$BJ$1)+1+COUNTIF($C$86:AN86,AN86)-1","v":-22},{"$f":"COUNTIF($C$86:$BJ$86,\"<\" & AO86)-COUNTBLANK($C$1:$BJ$1)+1+COUNTIF($C$86:AO86,AO86)-1","v":-21},{"$f":"COUNTIF($C$86:$BJ$86,\"<\" & AP86)-COUNTBLANK($C$1:$BJ$1)+1+COUNTIF($C$86:AP86,AP86)-1","v":-20},{"$f":"COUNTIF($C$86:$BJ$86,\"<\" & AQ86)-COUNTBLANK($C$1:$BJ$1)+1+COUNTIF($C$86:AQ86,AQ86)-1","v":-19},{"$f":"COUNTIF($C$86:$BJ$86,\"<\" & AR86)-COUNTBLANK($C$1:$BJ$1)+1+COUNTIF($C$86:AR86,AR86)-1","v":-18},{"$f":"COUNTIF($C$86:$BJ$86,\"<\" & AS86)-COUNTBLANK($C$1:$BJ$1)+1+COUNTIF($C$86:AS86,AS86)-1","v":-17},{"$f":"COUNTIF($C$86:$BJ$86,\"<\" & AT86)-COUNTBLANK($C$1:$BJ$1)+1+COUNTIF($C$86:AT86,AT86)-1","v":-16},{"$f":"COUNTIF($C$86:$BJ$86,\"<\" & AU86)-COUNTBLANK($C$1:$BJ$1)+1+COUNTIF($C$86:AU86,AU86)-1","v":-15},{"$f":"COUNTIF($C$86:$BJ$86,\"<\" & AV86)-COUNTBLANK($C$1:$BJ$1)+1+COUNTIF($C$86:AV86,AV86)-1","v":-14},{"$f":"COUNTIF($C$86:$BJ$86,\"<\" & AW86)-COUNTBLANK($C$1:$BJ$1)+1+COUNTIF($C$86:AW86,AW86)-1","v":-13},{"$f":"COUNTIF($C$86:$BJ$86,\"<\" & AX86)-COUNTBLANK($C$1:$BJ$1)+1+COUNTIF($C$86:AX86,AX86)-1","v":-12},{"$f":"COUNTIF($C$86:$BJ$86,\"<\" & AY86)-COUNTBLANK($C$1:$BJ$1)+1","v":-50},-50,-50,-50,-50,-50,-50,-50,null,null,{"$f":"COUNTIF($C$86:$BJ$86,\"<\" & BI86)-COUNTBLANK($C$1:$BJ$1)+1","v":-50},{"$f":"COUNTIF($C$86:$BJ$86,\"<\" & BJ86)-COUNTBLANK($C$1:$BJ$1)+1","v":-50}]

{"sheet":"Start Times","index":3,"n_rows":56,"n_cols":6,"rows_kept":56,"cut":false,"hidden":false,"merged":[[0,0,0,5],[1,0,1,5],[2,0,2,5]]}
[{"$f":"'Contest Entry'!B1","v":"SYC"}]
[{"$f":"'Contest Entry'!B2","v":"Stimson"}]
[{"$f":"'Contest Entry'!B3","v":"2018-09-15"}]
[]
["START and FINISH TIMES"]
[]
["Boat","Contestant","Yacht Club","Boat Speed","Start Time","Finish Time"]
[]
[{"$f":"IF(ROW()-8<=Number_of_Contestants,UPPER(INDEX(Boat_Names,,MATCH(ROW()-8,Start_Time_Rank,0))),\"\")","v":"SOJOURN"},{"$f":"IF(ROW()-8<=Number_of_Contestants,INDEX(Contestant_Names,,MATCH(ROW()-8,Start_Time_Rank,0)),\"\")","v":"Clint Chapin"},{"$f":"IF(ROW()-8<=Number_of_Contestants,INDEX(Club_Names,,MATCH(ROW()-8,Start_Time_Rank,0)),\"\")","v":"MBYC"},{"$f":"IF(ROW()-8<=Number_of_Contestants,INDEX(Cruise_Speeds,,MATCH(ROW()-8,Start_Time_Rank,0)),\"\")","v":7.3},{"$f":"IF(ROW()-8<=Number_of_Contestants,INDEX(Predicted_Start_Times,,MATCH(ROW()-8,Start_Time_Rank,0)),\"\")","v":123238},{"$f":"IF(ROW()-8<=Number_of_Contestants,INDEX(Finish_Times,,MATCH(ROW()-8,Start_Time_Rank,0)),\"\")","v":143000}]
["SARAH B","Jim VanAntwerp","BYC",7,124516,145000]
["SAGA","Dan DeGard","BYC",8,130732,145500]
["PEACHY KEEN","Mike Henry","BYC",8.1750000000000007,131621,150503]
["FREEDOM","Jim Korzetz","PYC",8.39,131939,150500]
["MISS MIRANDA","Larry O'Keefe","SYC",8.5920000000000005,134614,152948]
["PANACHE","Brent Reys","SYC",9.4740000000000002,140748,154000]
["KLETTITAT","Team Klett/Elbon/Cullen","QCYC",9.61,141816,155000]
["RAZZLE","Ken Case","SYC",9.89,142120,155300]
["","","","","",""]
["","","","","",""]
["","","","","",""]
["","","","","",""]
["","","","","",""]
["","","","","",""]
["","","","","",""]
["","","","","",""]
["","","","","",""]
["","","","","",""]
["","","","","",""]
["","","","","",""]
["","","","","",""]
["","","","","",""]
["","","","","",""]
["","","","","",""]
["","","","","",""]
["","","","","",""]
["","","","","",""]
["","","","","",""]
["","","","","",""]
["","","","","",""]
["","","","","",""]
[{"$f":"IF(ROW()-8<=Number_of_Contestants,UPPER(INDEX(Boat_Names,,MATCH(ROW()-8,Start_Time_Rank,0))),\"\")","v":""},{"$f":"IF(ROW()-8<=Number_of_Contestants,INDEX(Contestant_Names,,MATCH(ROW()-8,Start_Time_Rank,0)),\"\")","v":""},{"$f":"IF(ROW()-8<=Number_of_Contestants,INDEX(Club_Names,,MATCH(ROW()-8,Start_Time_Rank,0)),\"\")","v":""},{"$f":"IF(ROW()-8<=Number_of_Contestants,INDEX(Cruise_Speeds,,MATCH(ROW()-8,Start_Time_Rank,0)),\"\")","v":""},{"$f":"IF(ROW()-8<=Number_of_Contestants,INDEX(Predicted_Start_Times,,MATCH(ROW()-8,Start_Time_Rank,0)),\"\")","v":""},{"$f":"IF(ROW()-8<=Number_of_Contestants,INDEX(Finish_Times,,MATCH(ROW()-8,Start_Time_Rank,0)),\"\")","v":""}]
["","","","","",""]
["","","","","",""]
["","","","","",""]
["","","","","",""]
["","","","","",""]
["","","","","",""]
["","","","","",""]
["","","","","",""]
["","","","","",""]
["","","","","",""]
["","","","","",""]
["","","","","",""]
["","","","","",""]
["","","","","",""]
["","","","","",""]

{"sheet":"Overall Results","index":4,"n_rows":56,"n_cols":7,"rows_kept":56,"cut":false,"hidden":false,"merged":[[0,0,0,6],[1,0,1,6],[2,0,2,6]]}
[{"$f":"'Contest Entry'!B1","v":"SYC"}]
[{"$f":"'Contest Entry'!B2","v":"Stimson"}]
[{"$f":"'Contest Entry'!B3","v":"2018-09-15"}]
[]
["OVERALL RESULTS"]
[]
["Boat","Contestant","Navigator","Yacht Club","% Error","Place OA","NACA Pts"]
[]
[{"$f":"IF(F9<=Number_of_Contestants,UPPER(INDEX(Boat_Names,,MATCH(F9,Overall_Rank,0))),\"\")","v":"FREEDOM"},{"$f":"IF(F9<=Number_of_Contestants,INDEX(Contestant_Names,,MATCH(F9,Overall_Rank,0)),\"\")","v":"Jim Korzetz"},{"$f":"IF(F9<=Number_of_Contestants,INDEX(Navigator_Names,,MATCH(F9,Overall_Rank,0)),\"\")","v":"Dick Timmerman"},{"$f":"IF(F9<=Number_of_Contestants,INDEX(Club_Names,,MATCH(F9,Overall_Rank,0)),\"\")","v":"PYC"},{"$f":"IF(F9<=Number_of_Contestants,INDEX(Net_Error,,MATCH(F9,Overall_Rank,0)),\"\")","v":1.6159994474931739E-3},{"$f":"IF(ROW()-8<=Number_of_Contestants,ROW()-8,\"\")","v":1},{"$f":"IF(F9=\"\",\"\",1000-(((700*(F9-0.79))/(Number_of_Contestants-0.79))))","v":982.09500609013401}]
["SARAH B","Jim VanAntwerp","OJ Potter","BYC",3.1752538749331913E-3,2,{"$f":"IF(F10=\"\",\"\",1000-(((700*(F10-0.79))/(Number_of_Contestants-0.79))))","v":896.83313032886724}]
["PEACHY KEEN","Mike Henry","Billie Henry","BYC",4.1941011507304771E-3,3,811.57125456760048]
["MISS MIRANDA","Larry O'Keefe","Ted Burns","SYC",6.4239148038226475E-3,4,726.30937880633383]
["KLETTITAT","Team Klett/Elbon/Cullen","Elbon/Klett","QCYC",1.0157292930878926E-2,5,641.04750304506706]
["SOJOURN","Clint Chapin","Lynn Hvalsoe","MBYC",1.0173150145515989E-2,6,555.7856272838003]
["SAGA","Dan DeGard","JJ Johnson","BYC",1.157780450286458E-2,7,470.52375152253353]
["PANACHE","Brent Reys","Alex Lorenz","SYC",1.1920460184474077E-2,8,385.26187576126677]
["RAZZLE","Ken Case","Debbie Case","SYC",2.6682285139152495E-2,9,300]
["","","","","","",""]
["","","","","","",""]
["","","","","","",""]
["","","","","","",""]
["","","","","","",""]
["","","","","","",""]
["","","","","","",""]
["","","","","","",""]
["","","","","","",""]
["","","","","","",""]
["","","","","","",""]
["","","","","","",""]
["","","","","","",""]
["","","","","","",""]
["","","","","","",""]
["","","","","","",""]
["","","","","","",""]
["","","","","","",""]
["","","","","","",""]
["","","","","","",""]
["","","","","","",""]
["","","","","","",""]
["","","","","","",""]
[{"$f":"IF(F41<=Number_of_Contestants,UPPER(INDEX(Boat_Names,,MATCH(F41,Overall_Rank,0))),\"\")","v":""},{"$f":"IF(F41<=Number_of_Contestants,INDEX(Contestant_Names,,MATCH(F41,Overall_Rank,0)),\"\")","v":""},{"$f":"IF(F41<=Number_of_Contestants,INDEX(Navigator_Names,,MATCH(F41,Overall_Rank,0)),\"\")","v":""},{"$f":"IF(F41<=Number_of_Contestants,INDEX(Club_Names,,MATCH(F41,Overall_Rank,0)),\"\")","v":""},{"$f":"IF(F41<=Number_of_Contestants,INDEX(Net_Error,,MATCH(F41,Overall_Rank,0)),\"\")","v":""},"",""]
["","","","","","",""]
["","","","","","",""]
["","","","","","",""]
["","","","","","",""]
["","","","","","",""]
["","","","","","",""]
["","","","","","",""]
["","","","","","",""]
["","","","","","",""]
["","","","","","",""]
["","","","","","",""]
["","","","","","",""]
["","","","","","",""]
["","","","","","",""]
["","","","","","",""]

{"sheet":"Class Results","index":5,"n_rows":62,"n_cols":7,"rows_kept":62,"cut":false,"hidden":false,"merged":[[42,0,42,5],[52,0,52,5],[0,0,0,5],[1,0,1,5],[2,0,2,5],[12,0,12,5],[22,0,22,5],[32,0,32,5]]}
[{"$f":"'Contest Entry'!B1","v":"SYC"}]
[{"$f":"'Contest Entry'!B2","v":"Stimson"}]
[{"$f":"'Contest Entry'!B3","v":"2018-09-15"}]
[]
["CLASS RESULTS"]
[]
["Boat","Contestant","Navigator","Yacht Club","Percent Error","Place OA","Class Selector"]
[]
[{"$f":"IF(F9<=Number_of_Contestants,UPPER(INDEX(Boat_Names,,MATCH(F9,Overall_Rank,0))),\"\")","v":"FREEDOM"},{"$f":"IF(F9<=Number_of_Contestants,INDEX(Contestant_Names,,MATCH(F9,Overall_Rank,0)),\"\")","v":"Jim Korzetz"},{"$f":"IF(F9<=Number_of_Contestants,INDEX(Navigator_Names,,MATCH(F9,Overall_Rank,0)),\"\")","v":"Dick Timmerman"},{"$f":"IF(F9<=Number_of_Contestants,INDEX(Club_Names,,MATCH(F9,Overall_Rank,0)),\"\")","v":"PYC"},{"$f":"IF(F9<=Number_of_Contestants,INDEX(Net_Error,,MATCH(F9,Overall_Rank,0)),\"\")","v":1.6159994474931739E-3},{"$f":"IF(ROW()-8<=Number_of_Contestants,ROW()-8,\"\")","v":1}]
[{"$f":"IF(F10<=Number_of_Contestants,UPPER(INDEX(Boat_Names,,MATCH(F10,Overall_Rank,0))),\"\")","v":"SARAH B"},{"$f":"IF(F10<=Number_of_Contestants,INDEX(Contestant_Names,,MATCH(F10,Overall_Rank,0)),\"\")","v":"Jim VanAntwerp"},{"$f":"IF(F10<=Number_of_Contestants,INDEX(Navigator_Names,,MATCH(F10,Overall_Rank,0)),\"\")","v":"OJ Potter"},{"$f":"IF(F10<=Number_of_Contestants,INDEX(Club_Names,,MATCH(F10,Overall_Rank,0)),\"\")","v":"BYC"},{"$f":"IF(F10<=Number_of_Contestants,INDEX(Net_Error,,MATCH(F10,Overall_Rank,0)),\"\")","v":3.1752538749331913E-3},{"$f":"IF(ROW()-8<=Number_of_Contestants,ROW()-8,\"\")","v":2}]
[{"$f":"IF(F11<=Number_of_Contestants,UPPER(INDEX(Boat_Names,,MATCH(F11,Overall_Rank,0))),\"\")","v":"PEACHY KEEN"},{"$f":"IF(F11<=Number_of_Contestants,INDEX(Contestant_Names,,MATCH(F11,Overall_Rank,0)),\"\")","v":"Mike Henry"},{"$f":"IF(F11<=Number_of_Contestants,INDEX(Navigator_Names,,MATCH(F11,Overall_Rank,0)),\"\")","v":"Billie Henry"},{"$f":"IF(F11<=Number_of_Contestants,INDEX(Club_Names,,MATCH(F11,Overall_Rank,0)),\"\")","v":"BYC"},{"$f":"IF(F11<=Number_of_Contestants,INDEX(Net_Error,,MATCH(F11,Overall_Rank,0)),\"\")","v":4.1941011507304771E-3},{"$f":"IF(ROW()-8<=Number_of_Contestants,ROW()-8,\"\")","v":3}]
[]
["CLASS 1"]
[{"$f":"IF(ISNA(MATCH(G14,Class_Rank,0)),\"\",UPPER(INDEX(Boat_Names,,MATCH(G14,Class_Rank,0))))","v":"SOJOURN"},{"$f":"IF(ISNA(MATCH(G14,Class_Rank,0)),\"\",INDEX(Contestant_Names,,MATCH(G14,Class_Rank,0)))","v":"Clint Chapin"},{"$f":"IF(ISNA(MATCH(G14,Class_Rank,0)),\"\",INDEX(Navigator_Names,,MATCH(G14,Class_Rank,0)))","v":"Lynn Hvalsoe"},{"$f":"IF(ISNA(MATCH(G14,Class_Rank,0)),\"\",INDEX(Club_Names,,MATCH(G14,Class_Rank,0)))","v":"MBYC"},{"$f":"IF(ISNA(MATCH(G14,Class_Rank,0)),\"\",INDEX(Net_Error,,MATCH(G14,Class_Rank,0)))","v":1.0173150145515989E-2},{"$f":"IF(ISNA(MATCH(G14,Class_Rank,0)),\"\",INDEX(Overall_Rank,,MATCH(G14,Class_Rank,0)))","v":6},1.1000000000000001]
["","","","","","",1.2]
["","","","","","",1.3]
["","","","","","",1.4]
["","","","","","",1.5]
[{"$f":"IF(ISNA(MATCH(G19,Class_Rank,0)),\"\",UPPER(INDEX(Boat_Names,,MATCH(G19,Class_Rank,0))))","v":""},{"$f":"IF(ISNA(MATCH(G19,Class_Rank,0)),\"\",INDEX(Contestant_Names,,MATCH(G19,Class_Rank,0)))","v":""},{"$f":"IF(ISNA(MATCH(G19,Class_Rank,0)),\"\",INDEX(Navigator_Names,,MATCH(G19,Class_Rank,0)))","v":""},{"$f":"IF(ISNA(MATCH(G19,Class_Rank,0)),\"\",INDEX(Club_Names,,MATCH(G19,Class_Rank,0)))","v":""},{"$f":"IF(ISNA(MATCH(G19,Class_Rank,0)),\"\",INDEX(Net_Error,,MATCH(G19,Class_Rank,0)))","v":""},{"$f":"IF(ISNA(MATCH(G19,Class_Rank,0)),\"\",INDEX(Overall_Rank,,MATCH(G19,Class_Rank,0)))","v":""},1.6]
["","","","","","",1.7]
["","","","","","",1.8]
["","","","","","",1.9]
["CLASS 2"]
[{"$f":"IF(ISNA(MATCH(G24,Class_Rank,0)),\"\",UPPER(INDEX(Boat_Names,,MATCH(G24,Class_Rank,0))))","v":"SAGA"},{"$f":"IF(ISNA(MATCH(G24,Class_Rank,0)),\"\",INDEX(Contestant_Names,,MATCH(G24,Class_Rank,0)))","v":"Dan DeGard"},{"$f":"IF(ISNA(MATCH(G24,Class_Rank,0)),\"\",INDEX(Navigator_Names,,MATCH(G24,Class_Rank,0)))","v":"JJ Johnson"},{"$f":"IF(ISNA(MATCH(G24,Class_Rank,0)),\"\",INDEX(Club_Names,,MATCH(G24,Class_Rank,0)))","v":"BYC"},{"$f":"IF(ISNA(MATCH(G24,Class_Rank,0)),\"\",INDEX(Net_Error,,MATCH(G24,Class_Rank,0)))","v":1.157780450286458E-2},{"$f":"IF(ISNA(MATCH(G24,Class_Rank,0)),\"\",INDEX(Overall_Rank,,MATCH(G24,Class_Rank,0)))","v":7},2.1]
["","","","","","",2.2000000000000002]
["","","","","","",2.2999999999999998]
[{"$f":"IF(ISNA(MATCH(G27,Class_Rank,0)),\"\",UPPER(INDEX(Boat_Names,,MATCH(G27,Class_Rank,0))))","v":""},{"$f":"IF(ISNA(MATCH(G27,Class_Rank,0)),\"\",INDEX(Contestant_Names,,MATCH(G27,Class_Rank,0)))","v":""},{"$f":"IF(ISNA(MATCH(G27,Class_Rank,0)),\"\",INDEX(Navigator_Names,,MATCH(G27,Class_Rank,0)))","v":""},{"$f":"IF(ISNA(MATCH(G27,Class_Rank,0)),\"\",INDEX(Club_Names,,MATCH(G27,Class_Rank,0)))","v":""},{"$f":"IF(ISNA(MATCH(G27,Class_Rank,0)),\"\",INDEX(Net_Error,,MATCH(G27,Class_Rank,0)))","v":""},{"$f":"IF(ISNA(MATCH(G27,Class_Rank,0)),\"\",INDEX(Overall_Rank,,MATCH(G27,Class_Rank,0)))","v":""},2.4]
["","","","","","",2.5]
["","","","","","",2.6]
["","","","","","",2.7]
["","","","","","",2.8]
["","","","","","",2.9]
["CLASS 3"]
[{"$f":"IF(ISNA(MATCH(G34,Class_Rank,0)),\"\",UPPER(INDEX(Boat_Names,,MATCH(G34,Class_Rank,0))))","v":"MISS MIRANDA"},{"$f":"IF(ISNA(MATCH(G34,Class_Rank,0)),\"\",INDEX(Contestant_Names,,MATCH(G34,Class_Rank,0)))","v":"Larry O'Keefe"},{"$f":"IF(ISNA(MATCH(G34,Class_Rank,0)),\"\",INDEX(Navigator_Names,,MATCH(G34,Class_Rank,0)))","v":"Ted Burns"},{"$f":"IF(ISNA(MATCH(G34,Class_Rank,0)),\"\",INDEX(Club_Names,,MATCH(G34,Class_Rank,0)))","v":"SYC"},{"$f":"IF(ISNA(MATCH(G34,Class_Rank,0)),\"\",INDEX(Net_Error,,MATCH(G34,Class_Rank,0)))","v":6.4239148038226475E-3},{"$f":"IF(ISNA(MATCH(G34,Class_Rank,0)),\"\",INDEX(Overall_Rank,,MATCH(G34,Class_Rank,0)))","v":4},3.1]
["","","","","","",3.2]
["","","","","","",3.3]
["","","","","","",3.4]
[{"$f":"IF(ISNA(MATCH(G38,Class_Rank,0)),\"\",UPPER(INDEX(Boat_Names,,MATCH(G38,Class_Rank,0))))","v":""},{"$f":"IF(ISNA(MATCH(G38,Class_Rank,0)),\"\",INDEX(Contestant_Names,,MATCH(G38,Class_Rank,0)))","v":""},{"$f":"IF(ISNA(MATCH(G38,Class_Rank,0)),\"\",INDEX(Navigator_Names,,MATCH(G38,Class_Rank,0)))","v":""},{"$f":"IF(ISNA(MATCH(G38,Class_Rank,0)),\"\",INDEX(Club_Names,,MATCH(G38,Class_Rank,0)))","v":""},{"$f":"IF(ISNA(MATCH(G38,Class_Rank,0)),\"\",INDEX(Net_Error,,MATCH(G38,Class_Rank,0)))","v":""},{"$f":"IF(ISNA(MATCH(G38,Class_Rank,0)),\"\",INDEX(Overall_Rank,,MATCH(G38,Class_Rank,0)))","v":""},3.5]
["","","","","","",3.6]
["","","","","","",3.7]
["","","","","","",3.8]
["","","","","","",3.9]
["CLASS 4"]
[{"$f":"IF(ISNA(MATCH(G44,Class_Rank,0)),\"\",UPPER(INDEX(Boat_Names,,MATCH(G44,Class_Rank,0))))","v":"PANACHE"},{"$f":"IF(ISNA(MATCH(G44,Class_Rank,0)),\"\",INDEX(Contestant_Names,,MATCH(G44,Class_Rank,0)))","v":"Brent Reys"},{"$f":"IF(ISNA(MATCH(G44,Class_Rank,0)),\"\",INDEX(Navigator_Names,,MATCH(G44,Class_Rank,0)))","v":"Alex Lorenz"},{"$f":"IF(ISNA(MATCH(G44,Class_Rank,0)),\"\",INDEX(Club_Names,,MATCH(G44,Class_Rank,0)))","v":"SYC"},{"$f":"IF(ISNA(MATCH(G44,Class_Rank,0)),\"\",INDEX(Net_Error,,MATCH(G44,Class_Rank,0)))","v":1.1920460184474077E-2},{"$f":"IF(ISNA(MATCH(G44,Class_Rank,0)),\"\",INDEX(Overall_Rank,,MATCH(G44,Class_Rank,0)))","v":8},4.0999999999999996]
["","","","","","",4.2]
["","","","","","",4.3]
["","","","","","",4.4000000000000004]
[{"$f":"IF(ISNA(MATCH(G48,Class_Rank,0)),\"\",UPPER(INDEX(Boat_Names,,MATCH(G48,Class_Rank,0))))","v":""},{"$f":"IF(ISNA(MATCH(G48,Class_Rank,0)),\"\",INDEX(Contestant_Names,,MATCH(G48,Class_Rank,0)))","v":""},{"$f":"IF(ISNA(MATCH(G48,Class_Rank,0)),\"\",INDEX(Navigator_Names,,MATCH(G48,Class_Rank,0)))","v":""},{"$f":"IF(ISNA(MATCH(G48,Class_Rank,0)),\"\",INDEX(Club_Names,,MATCH(G48,Class_Rank,0)))","v":""},{"$f":"IF(ISNA(MATCH(G48,Class_Rank,0)),\"\",INDEX(Net_Error,,MATCH(G48,Class_Rank,0)))","v":""},{"$f":"IF(ISNA(MATCH(G48,Class_Rank,0)),\"\",INDEX(Overall_Rank,,MATCH(G48,Class_Rank,0)))","v":""},4.5]
["","","","","","",4.5999999999999996]
["","","","","","",4.7]
["","","","","","",4.8]
["","","","","","",4.9000000000000004]
["CLASS 5"]
[{"$f":"IF(ISNA(MATCH(G54,Class_Rank,0)),\"\",UPPER(INDEX(Boat_Names,,MATCH(G54,Class_Rank,0))))","v":"KLETTITAT"},{"$f":"IF(ISNA(MATCH(G54,Class_Rank,0)),\"\",INDEX(Contestant_Names,,MATCH(G54,Class_Rank,0)))","v":"Team Klett/Elbon/Cullen"},{"$f":"IF(ISNA(MATCH(G54,Class_Rank,0)),\"\",INDEX(Navigator_Names,,MATCH(G54,Class_Rank,0)))","v":"Elbon/Klett"},{"$f":"IF(ISNA(MATCH(G54,Class_Rank,0)),\"\",INDEX(Club_Names,,MATCH(G54,Class_Rank,0)))","v":"QCYC"},{"$f":"IF(ISNA(MATCH(G54,Class_Rank,0)),\"\",INDEX(Net_Error,,MATCH(G54,Class_Rank,0)))","v":1.0157292930878926E-2},{"$f":"IF(ISNA(MATCH(G54,Class_Rank,0)),\"\",INDEX(Overall_Rank,,MATCH(G54,Class_Rank,0)))","v":5},5.0999999999999996]
["RAZZLE","Ken Case","Debbie Case","SYC",2.6682285139152495E-2,9,5.2]
["","","","","","",5.3]
["","","","","","",5.4]
[{"$f":"IF(ISNA(MATCH(G58,Class_Rank,0)),\"\",UPPER(INDEX(Boat_Names,,MATCH(G58,Class_Rank,0))))","v":""},{"$f":"IF(ISNA(MATCH(G58,Class_Rank,0)),\"\",INDEX(Contestant_Names,,MATCH(G58,Class_Rank,0)))","v":""},{"$f":"IF(ISNA(MATCH(G58,Class_Rank,0)),\"\",INDEX(Navigator_Names,,MATCH(G58,Class_Rank,0)))","v":""},{"$f":"IF(ISNA(MATCH(G58,Class_Rank,0)),\"\",INDEX(Club_Names,,MATCH(G58,Class_Rank,0)))","v":""},{"$f":"IF(ISNA(MATCH(G58,Class_Rank,0)),\"\",INDEX(Net_Error,,MATCH(G58,Class_Rank,0)))","v":""},{"$f":"IF(ISNA(MATCH(G58,Class_Rank,0)),\"\",INDEX(Overall_Rank,,MATCH(G58,Class_Rank,0)))","v":""},5.5]
["","","","","","",5.6]
["","","","","","",5.7]
["","","","","","",5.8]
["","","","","","",5.9]

{"sheet":"Novice Results","index":6,"n_rows":68,"n_cols":6,"rows_kept":68,"cut":false,"hidden":false,"merged":[[0,0,0,5],[1,0,1,5],[2,0,2,5]]}
[{"$f":"'Contest Entry'!B1","v":"SYC"}]
[{"$f":"'Contest Entry'!B2","v":"Stimson"}]
[{"$f":"'Contest Entry'!B3","v":"2018-09-15"}]
[]
["NOVICE RESULTS"]
[]
["Boat","Contestant","Navigator","Yacht Club","% Error","Novice"]
[]
[{"$f":"IF(F9<=Number_of_Novices,UPPER(INDEX(Boat_Names,,MATCH(F9,Novice_Rank,0))),\"\")","v":"SAGA"},{"$f":"IF(F9<=Number_of_Novices,INDEX(Contestant_Names,,MATCH(F9,Novice_Rank,0)),\"\")","v":"Dan DeGard"},{"$f":"IF(F9<=Number_of_Novices,INDEX(Navigator_Names,,MATCH(F9,Novice_Rank,0)),\"\")","v":"JJ Johnson"},{"$f":"IF(F9<=Number_of_Novices,INDEX(Club_Names,,MATCH(F9,Novice_Rank,0)),\"\")","v":"BYC"},{"$f":"IF(F9<=Number_of_Novices,INDEX(Net_Error,,MATCH(F9,Novice_Rank,0)),\"\")","v":1.157780450286458E-2},{"$f":"IF(ROW()-8<=Number_of_Novices,ROW()-8,\"\")","v":1}]
["","","","","",""]
["","","","","",""]
["","","","","",""]
["","","","","",""]
["","","","","",""]
["","","","","",""]
["","","","","",""]
["","","","","",""]
["","","","","",""]
["","","","","",""]
["","","","","",""]
["","","","","",""]
["","","","","",""]
["","","","","",""]
["","","","","",""]
["","","","","",""]
["","","","","",""]
["","","","","",""]
["","","","","",""]
["","","","","",""]
["","","","","",""]
["","","","","",""]
["","","","","",""]
["","","","","",""]
["","","","","",""]
["","","","","",""]
["","","","","",""]
["","","","","",""]
["","","","","",""]
["","","","","",""]
["","","","","",""]
[{"$f":"IF(F41<=Number_of_Novices,UPPER(INDEX(Boat_Names,,MATCH(F41,Novice_Rank,0))),\"\")","v":""},{"$f":"IF(F41<=Number_of_Novices,INDEX(Contestant_Names,,MATCH(F41,Novice_Rank,0)),\"\")","v":""},{"$f":"IF(F41<=Number_of_Novices,INDEX(Navigator_Names,,MATCH(F41,Novice_Rank,0)),\"\")","v":""},{"$f":"IF(F41<=Number_of_Novices,INDEX(Club_Names,,MATCH(F41,Novice_Rank,0)),\"\")","v":""},{"$f":"IF(F41<=Number_of_Novices,INDEX(Net_Error,,MATCH(F41,Novice_Rank,0)),\"\")","v":""},""]
["","","","","",""]
["","","","","",""]
["","","","","",""]
["","","","","",""]
["","","","","",""]
["","","","","",""]
["","","","","",""]
["","","","","",""]
["","","","","",""]
["","","","","",""]
["","","","","",""]
["","","","","",""]
["","","","","",""]
["","","","","",""]
["","","","","",""]
["","","","","",""]
["","","","","",""]
["","","","","",""]
["","","","","",""]
["","","","","",""]
["","","","","",""]
["","","","","",""]
["","","","","",""]
["","","","","",""]
["","","","","",""]
[{"$f":"IF(F67<=Number_of_Novices,UPPER(INDEX('Log Entry'!$C$4:$BJ$4,,MATCH(F67,'Log Entry'!$C$81:$BJ$81,0))),\"\")","v":""},{"$f":"IF(F67<=Number_of_Novices,INDEX('Log Entry'!$C$2:$BJ$2,,MATCH(F67,'Log Entry'!$C$81:$BJ$81,0)),\"\")","v":""},{"$f":"IF(F67<=Number_of_Novices,INDEX('Log Entry'!$C$3:$BJ$3,,MATCH(F67,'Log Entry'!$C$81:$BJ$81,0)),\"\")","v":""},{"$f":"IF(F67<=Number_of_Novices,INDEX('Log Entry'!$C$5:$BJ$5,,MATCH(F67,'Log Entry'!$C$81:$BJ$81,0)),\"\")","v":""},{"$f":"IF(F67<=Number_of_Novices,INDEX('Log Entry'!$C$75:$BJ$75,,MATCH(F67,'Log Entry'!$C$81:$BJ$81,0)),\"\")","v":""},{"$f":"IF(ROW()-8<=Number_of_Novices,ROW()-8,\"\")","v":""}]
[{"$f":"IF(F68<=Number_of_Novices,UPPER(INDEX('Log Entry'!$C$4:$BJ$4,,MATCH(F68,'Log Entry'!$C$81:$BJ$81,0))),\"\")","v":""},{"$f":"IF(F68<=Number_of_Novices,INDEX('Log Entry'!$C$2:$BJ$2,,MATCH(F68,'Log Entry'!$C$81:$BJ$81,0)),\"\")","v":""},{"$f":"IF(F68<=Number_of_Novices,INDEX('Log Entry'!$C$3:$BJ$3,,MATCH(F68,'Log Entry'!$C$81:$BJ$81,0)),\"\")","v":""},{"$f":"IF(F68<=Number_of_Novices,INDEX('Log Entry'!$C$5:$BJ$5,,MATCH(F68,'Log Entry'!$C$81:$BJ$81,0)),\"\")","v":""},{"$f":"IF(F68<=Number_of_Novices,INDEX('Log Entry'!$C$75:$BJ$75,,MATCH(F68,'Log Entry'!$C$81:$BJ$81,0)),\"\")","v":""},""]

{"sheet":"Boats & Observers","index":7,"n_rows":56,"n_cols":5,"rows_kept":56,"cut":false,"hidden":false,"merged":[[0,0,0,4],[1,0,1,4],[2,0,2,4]]}
[{"$f":"'Contest Entry'!B1","v":"SYC"}]
[{"$f":"'Contest Entry'!B2","v":"Stimson"}]
[{"$f":"'Contest Entry'!B3","v":"2018-09-15"}]
[]
["BOAT and OBSERVER LIST"]
[]
["Boat","Contestant","Navigator","Club","Observer"]
[]
[{"$f":"IF(ROW()-8<=Number_of_Contestants,UPPER(INDEX(Boat_Names,,MATCH(ROW()-8,Alpha_Boat_Rank,0))),\"\")","v":"FREEDOM"},{"$f":"IF(ROW()-8<=Number_of_Contestants,INDEX(Contestant_Names,,MATCH(ROW()-8,Alpha_Boat_Rank,0)),\"\")","v":"Jim Korzetz"},{"$f":"IF(ROW()-8<=Number_of_Contestants,INDEX(Navigator_Names,,MATCH(ROW()-8,Alpha_Boat_Rank,0)),\"\")","v":"Dick Timmerman"},{"$f":"IF(ROW()-8<=Number_of_Contestants,INDEX(Club_Names,,MATCH(ROW()-8,Alpha_Boat_Rank,0)),\"\")","v":"PYC"},{"$f":"IF(ROW()-8<=Number_of_Contestants,INDEX(Observer_Names,,MATCH(ROW()-8,Alpha_Boat_Rank,0)),\"\")","v":0}]
["KLETTITAT","Team Klett/Elbon/Cullen","Elbon/Klett","QCYC",0]
["MISS MIRANDA","Larry O'Keefe","Ted Burns","SYC",0]
["PANACHE","Brent Reys","Alex Lorenz","SYC",0]
["PEACHY KEEN","Mike Henry","Billie Henry","BYC",0]
["RAZZLE","Ken Case","Debbie Case","SYC",0]
["SAGA","Dan DeGard","JJ Johnson","BYC",0]
["SARAH B","Jim VanAntwerp","OJ Potter","BYC",0]
["SOJOURN","Clint Chapin","Lynn Hvalsoe","MBYC",0]
["","","","",""]
["","","","",""]
["","","","",""]
["","","","",""]
["","","","",""]
["","","","",""]
["","","","",""]
["","","","",""]
["","","","",""]
["","","","",""]
["","","","",""]
["","","","",""]
["","","","",""]
["","","","",""]
["","","","",""]
["","","","",""]
["","","","",""]
["","","","",""]
["","","","",""]
["","","","",""]
["","","","",""]
["","","","",""]
["","","","",""]
[{"$f":"IF(ROW()-8<=Number_of_Contestants,UPPER(INDEX(Boat_Names,,MATCH(ROW()-8,Alpha_Boat_Rank,0))),\"\")","v":""},{"$f":"IF(ROW()-8<=Number_of_Contestants,INDEX(Contestant_Names,,MATCH(ROW()-8,Alpha_Boat_Rank,0)),\"\")","v":""},{"$f":"IF(ROW()-8<=Number_of_Contestants,INDEX(Navigator_Names,,MATCH(ROW()-8,Alpha_Boat_Rank,0)),\"\")","v":""},{"$f":"IF(ROW()-8<=Number_of_Contestants,INDEX(Club_Names,,MATCH(ROW()-8,Alpha_Boat_Rank,0)),\"\")","v":""},{"$f":"IF(ROW()-8<=Number_of_Contestants,INDEX(Observer_Names,,MATCH(ROW()-8,Alpha_Boat_Rank,0)),\"\")","v":""}]
["","","","",""]
["","","","",""]
["","","","",""]
["","","","",""]
["","","","",""]
["","","","",""]
["","","","",""]
["","","","",""]
["","","","",""]
["","","","",""]
["","","","",""]
["","","","",""]
["","","","",""]
["","","","",""]
["","","","",""]

{"sheet":"Club Participation","index":8,"n_rows":70,"n_cols":7,"rows_kept":70,"cut":false,"hidden":false,"merged":[[0,3,0,5],[1,3,1,5],[2,3,2,5]]}
[null,null,null,{"$f":"'Contest Entry'!B1","v":"SYC"}]
[null,null,null,{"$f":"'Contest Entry'!B2","v":"Stimson"}]
[null,null,null,{"$f":"'Contest Entry'!B3","v":"2018-09-15"}]
[]
[null,null,"YACHT CLUB PARTICIPATION"]
[]
[null,null,"Yacht Club","Boat","Contestant","Navigator"]
[null,1]
[{"$f":"IF(AND(B8=1,C9<>\"\"),B9,\"\")","v":3},{"$f":"IF(C9=C10,B10+1,1)","v":3},{"$f":"IF(ROW()-8<=Number_of_Contestants,INDEX(Club_Names,,MATCH(ROW()-8,Club_Boat_Rank,0)),\"\")","v":"BYC"},{"$f":"IF(ROW()-8<=Number_of_Contestants,UPPER(INDEX(Boat_Names,,MATCH(ROW()-8,Club_Boat_Rank,0))),\"\")","v":"PEACHY KEEN"},{"$f":"IF(ROW()-8<=Number_of_Contestants,INDEX(Contestant_Names,,MATCH(ROW()-8,Club_Boat_Rank,0)),\"\")","v":"Mike Henry"},{"$f":"IF(ROW()-8<=Number_of_Contestants,INDEX(Navigator_Names,,MATCH(ROW()-8,Club_Boat_Rank,0)),\"\")","v":"Billie Henry"}]
[{"$f":"IF(AND(B9=1,C10<>\"\"),B10,\"\")","v":""},{"$f":"IF(C10=C11,B11+1,1)","v":2},"BYC","SAGA","Dan DeGard","JJ Johnson"]
["",1,"BYC","SARAH B","Jim VanAntwerp","OJ Potter"]
[1,1,"MBYC","SOJOURN","Clint Chapin","Lynn Hvalsoe"]
[1,1,"PYC","FREEDOM","Jim Korzetz","Dick Timmerman"]
[1,1,"QCYC","KLETTITAT","Team Klett/Elbon/Cullen","Elbon/Klett"]
[3,3,"SYC","MISS MIRANDA","Larry O'Keefe","Ted Burns"]
["",2,"SYC","PANACHE","Brent Reys","Alex Lorenz"]
["",1,"SYC","RAZZLE","Ken Case","Debbie Case"]
["",39,"","","",""]
["",38,"","","",""]
["",37,"","","",""]
["",36,"","","",""]
["",35,"","","",""]
["",34,"","","",""]
["",33,"","","",""]
["",32,"","","",""]
["",31,"","","",""]
["",30,"","","",""]
["",29,"","","",""]
["",28,"","","",""]
["",27,"","","",""]
["",26,"","","",""]
["",25,"","","",""]
["",24,"","","",""]
["",23,"","","",""]
["",22,"","","",""]
["",21,"","","",""]
["",20,"","","",""]
["",19,"","","",""]
[{"$f":"IF(AND(B38=1,C39<>\"\"),B39,\"\")","v":""},{"$f":"IF(C39=C40,B40+1,1)","v":18},"","","",""]
["",17,"","","",""]
["",16,{"$f":"IF(ROW()-8<=Number_of_Contestants,INDEX(Club_Names,,MATCH(ROW()-8,Club_Boat_Rank,0)),\"\")","v":""},{"$f":"IF(ROW()-8<=Number_of_Contestants,UPPER(INDEX(Boat_Names,,MATCH(ROW()-8,Club_Boat_Rank,0))),\"\")","v":""},{"$f":"IF(ROW()-8<=Number_of_Contestants,INDEX(Contestant_Names,,MATCH(ROW()-8,Club_Boat_Rank,0)),\"\")","v":""},{"$f":"IF(ROW()-8<=Number_of_Contestants,INDEX(Navigator_Names,,MATCH(ROW()-8,Club_Boat_Rank,0)),\"\")","v":""}]
["",15,"","","",""]
["",14,"","","",""]
["",13,"","","",""]
["",12,"","","",""]
["",11,"","","",""]
["",10,"","","",""]
["",9,"","","",""]
["",8,"","","",""]
["",7,"","","",""]
["",6,"","","",""]
["",5,"","","",""]
["",4,"","","",""]
["",3,"","","",""]
["",2,"","","",""]
["",{"$f":"IF(C56=C57,B57+1,1)","v":1},"","","",""]
[null,null,null,null,null,null,{"$f":"IF(ROW()-8<=Number_of_Contestants,INDEX('Log Entry'!$C$3:$BJ$3,,MATCH(ROW()-8,'Log Entry'!$C$85:$BJ$85,0)),\"\")","v":""}]
[null,null,null,null,null,null,{"$f":"IF(ROW()-8<=Number_of_Contestants,INDEX('Log Entry'!$C$3:$BJ$3,,MATCH(ROW()-8,'Log Entry'!$C$85:$BJ$85,0)),\"\")","v":""}]
[null,null,null,null,null,null,{"$f":"IF(ROW()-8<=Number_of_Contestants,INDEX('Log Entry'!$C$3:$BJ$3,,MATCH(ROW()-8,'Log Entry'!$C$85:$BJ$85,0)),\"\")","v":""}]
[null,null,null,null,null,null,{"$f":"IF(ROW()-8<=Number_of_Contestants,INDEX('Log Entry'!$C$3:$BJ$3,,MATCH(ROW()-8,'Log Entry'!$C$85:$BJ$85,0)),\"\")","v":""}]
[null,null,null,null,null,null,{"$f":"IF(ROW()-8<=Number_of_Contestants,INDEX('Log Entry'!$C$3:$BJ$3,,MATCH(ROW()-8,'Log Entry'!$C$85:$BJ$85,0)),\"\")","v":""}]
[null,null,null,null,null,null,{"$f":"IF(ROW()-8<=Number_of_Contestants,INDEX('Log Entry'!$C$3:$BJ$3,,MATCH(ROW()-8,'Log Entry'!$C$85:$BJ$85,0)),\"\")","v":""}]
[null,null,null,null,null,null,{"$f":"IF(ROW()-8<=Number_of_Contestants,INDEX('Log Entry'!$C$3:$BJ$3,,MATCH(ROW()-8,'Log Entry'!$C$85:$BJ$85,0)),\"\")","v":""}]
[null,null,null,null,null,null,{"$f":"IF(ROW()-8<=Number_of_Contestants,INDEX('Log Entry'!$C$3:$BJ$3,,MATCH(ROW()-8,'Log Entry'!$C$85:$BJ$85,0)),\"\")","v":""}]
[null,null,null,null,null,null,{"$f":"IF(ROW()-8<=Number_of_Contestants,INDEX('Log Entry'!$C$3:$BJ$3,,MATCH(ROW()-8,'Log Entry'!$C$85:$BJ$85,0)),\"\")","v":""}]
[null,null,null,null,null,null,{"$f":"IF(ROW()-8<=Number_of_Contestants,INDEX('Log Entry'!$C$3:$BJ$3,,MATCH(ROW()-8,'Log Entry'!$C$85:$BJ$85,0)),\"\")","v":""}]
[null,null,null,null,null,null,{"$f":"IF(ROW()-8<=Number_of_Contestants,INDEX('Log Entry'!$C$3:$BJ$3,,MATCH(ROW()-8,'Log Entry'!$C$85:$BJ$85,0)),\"\")","v":""}]
[null,null,null,null,null,null,{"$f":"IF(ROW()-8<=Number_of_Contestants,INDEX('Log Entry'!$C$3:$BJ$3,,MATCH(ROW()-8,'Log Entry'!$C$85:$BJ$85,0)),\"\")","v":""}]
[null,null,null,null,null,null,{"$f":"IF(ROW()-8<=Number_of_Contestants,INDEX('Log Entry'!$C$3:$BJ$3,,MATCH(ROW()-8,'Log Entry'!$C$85:$BJ$85,0)),\"\")","v":""}]
[null,null,null,null,null,null,{"$f":"IF(ROW()-8<=Number_of_Contestants,INDEX('Log Entry'!$C$3:$BJ$3,,MATCH(ROW()-8,'Log Entry'!$C$85:$BJ$85,0)),\"\")","v":""}]

{"sheet":"Team Trophy","index":9,"n_rows":56,"n_cols":8,"rows_kept":56,"cut":false,"hidden":false,"merged":[[0,2,0,7],[1,2,1,7],[2,2,2,7]]}
[null,null,{"$f":"'Contest Entry'!B1","v":"SYC"}]
[null,null,{"$f":"'Contest Entry'!B2","v":"Stimson"}]
[null,null,{"$f":"'Contest Entry'!B3","v":"2018-09-15"}]
[]
[null,null,"TEAM TROPHY"]
[]
[null,null,"Boat","Contestant","Navigator","Yacht Club","Percent Error","Avg Error"]
[null,1]
[{"$f":"RANK(H9,$H$9:$H$70,1)-ROWS($A$9:$A$70)+COUNTIF($H$9:$H$70,\"<>0\")","v":1},{"$f":"IF(F9=F10,B10+1,1)","v":3},{"$f":"IF(ROW()-8<=Number_of_Contestants,UPPER(INDEX(Boat_Names,,MATCH(ROW()-8,Club_Error_Rank,0))),\"\")","v":"SARAH B"},{"$f":"IF(ROW()-8<=Number_of_Contestants,INDEX(Contestant_Names,,MATCH(ROW()-8,Club_Error_Rank,0)),\"\")","v":"Jim VanAntwerp"},{"$f":"IF(ROW()-8<=Number_of_Contestants,INDEX(Navigator_Names,,MATCH(ROW()-8,Club_Error_Rank,0)),\"\")","v":"OJ Potter"},{"$f":"IF(ROW()-8<=Number_of_Contestants,INDEX(Club_Names,,MATCH(ROW()-8,Club_Error_Rank,0)),\"\")","v":"BYC"},{"$f":"IF(ROW()-8<=Number_of_Contestants,INDEX(Net_Error,,MATCH(ROW()-8,Club_Error_Rank,0)),\"\")","v":3.1752538749331913E-3},{"$f":"IF(AND(ROW()-8<=Number_of_Contestants,B8=1,B9>=Team_Size),AVERAGE(OFFSET(G9,0,0,Team_Size,1)),0)","v":6.3157198428427487E-3}]
[-45,{"$f":"IF(F10=F11,B11+1,1)","v":2},"PEACHY KEEN","Mike Henry","Billie Henry","BYC",4.1941011507304771E-3,0]
[-45,1,"SAGA","Dan DeGard","JJ Johnson","BYC",1.157780450286458E-2,0]
[-45,1,"SOJOURN","Clint Chapin","Lynn Hvalsoe","MBYC",1.0173150145515989E-2,0]
[-45,1,"FREEDOM","Jim Korzetz","Dick Timmerman","PYC",1.6159994474931739E-3,0]
[-45,1,"KLETTITAT","Team Klett/Elbon/Cullen","Elbon/Klett","QCYC",1.0157292930878926E-2,0]
[2,3,"MISS MIRANDA","Larry O'Keefe","Ted Burns","SYC",6.4239148038226475E-3,1.500888670914974E-2]
[-45,2,"PANACHE","Brent Reys","Alex Lorenz","SYC",1.1920460184474077E-2,0]
[-45,1,"RAZZLE","Ken Case","Debbie Case","SYC",2.6682285139152495E-2,0]
[-45,39,"","","","","",0]
[-45,38,"","","","","",0]
[-45,37,"","","","","",0]
[-45,36,"","","","","",0]
[-45,35,"","","","","",0]
[-45,34,"","","","","",0]
[-45,33,"","","","","",0]
[-45,32,"","","","","",0]
[-45,31,"","","","","",0]
[-45,30,"","","","","",0]
[-45,29,"","","","","",0]
[-45,28,"","","","","",0]
[-45,27,"","","","","",0]
[-45,26,"","","","","",0]
[-45,25,"","","","","",0]
[-45,24,"","","","","",0]
[-45,23,"","","","","",0]
[-45,22,"","","","","",0]
[-45,{"$f":"IF(F36=F37,B37+1,1)","v":21},"","","","","",0]
[-45,20,"","","","","",0]
[-45,19,"","","","","",0]
[-45,18,"","","","","",0]
[-45,17,"","","","","",0]
[-45,16,{"$f":"IF(ROW()-8<=Number_of_Contestants,UPPER(INDEX(Boat_Names,,MATCH(ROW()-8,Club_Error_Rank,0))),\"\")","v":""},{"$f":"IF(ROW()-8<=Number_of_Contestants,INDEX(Contestant_Names,,MATCH(ROW()-8,Club_Error_Rank,0)),\"\")","v":""},{"$f":"IF(ROW()-8<=Number_of_Contestants,INDEX(Navigator_Names,,MATCH(ROW()-8,Club_Error_Rank,0)),\"\")","v":""},{"$f":"IF(ROW()-8<=Number_of_Contestants,INDEX(Club_Names,,MATCH(ROW()-8,Club_Error_Rank,0)),\"\")","v":""},{"$f":"IF(ROW()-8<=Number_of_Contestants,INDEX(Net_Error,,MATCH(ROW()-8,Club_Error_Rank,0)),\"\")","v":""},{"$f":"IF(AND(ROW()-8<=Number_of_Contestants,B40=1,B41>=Team_Size),AVERAGE(OFFSET(G41,0,0,Team_Size,1)),0)","v":0}]
[-45,15,"","","","","",0]
[-45,14,"","","","","",0]
[-45,13,"","","","","",0]
[-45,12,"","","","","",0]
[-45,11,"","","","","",0]
[-45,10,"","","","","",0]
[-45,9,"","","","","",0]
[-45,8,"","","","","",0]
[-45,7,"","","","","",0]
[-45,6,"","","","","",0]
[-45,5,"","","","","",0]
[-45,4,"","","","","",0]
[-45,3,"","","","","",0]
[-45,2,"","","","","",0]
[-45,1,"","","","","",0]

{"sheet":"Leg Scores","index":10,"n_rows":72,"n_cols":11,"rows_kept":72,"cut":false,"hidden":false,"merged":[[0,0,0,10],[1,0,1,10],[2,0,2,10]]}
[{"$f":"'Contest Entry'!B1","v":"SYC"}]
[{"$f":"'Contest Entry'!B2","v":"Stimson"}]
[{"$f":"'Contest Entry'!B3","v":"2018-09-15"}]
[]
["BEST LOW SCORE PER LEG"]
[]
["Boat","Club","Contestant","CP1","CP2","CP3","CP4","CP5","CP6","CP7","CP8"]
[null,null,"Worst:",{"$f":"MAX(D$11:D$69)","v":50},{"$f":"MAX(E$11:E$69)","v":122},43,36,0,{"$f":"MAX(I$11:I$69)","v":0},0,0]
[null,null,"Average:",{"$f":"AVERAGE(D$11:D$69)","v":23},{"$f":"AVERAGE(E$11:E$69)","v":33.777777777777779},19.444444444444443,11.333333333333334,{"$error":"#DIV/0!"},{"$f":"AVERAGE(I$11:I$69)","v":{"$error":"#DIV/0!"}},{"$error":"#DIV/0!"},{"$error":"#DIV/0!"}]
[{"$f":"ROW()","v":10},null,"Best:",{"$f":"MIN(D$11:D$69)","v":0},1,5,2,0,0,0,0]
[{"$f":"IF(ROW()-$A$10<=Number_of_Contestants,UPPER(INDEX(Boat_Names,,MATCH(ROW()-$A$10,Alpha_Boat_Rank,0))),\"\")","v":"FREEDOM"},{"$f":"IF(ROW()-$A$10<=Number_of_Contestants,INDEX(Club_Names,,MATCH(ROW()-$A$10,Alpha_Boat_Rank,0)),\"\")","v":"PYC"},{"$f":"IF(ROW()-$A$10<=Number_of_Contestants,INDEX(Contestant_Names,,MATCH(ROW()-$A$10,Alpha_Boat_Rank,0)),\"\")","v":"Jim Korzetz"},{"$f":"IF(AND(ROW()-$A$10<=Number_of_Contestants,COLUMN()-3<=Number_of_CPs),ABS(INDEX(CP1_Error,,MATCH(ROW()-$A$10,Alpha_Boat_Rank,0))),\"\")","v":0},{"$f":"IF(AND(ROW()-$A$10<=Number_of_Contestants,COLUMN()-3<=Number_of_CPs),ABS(INDEX(CP2_Error,,MATCH(ROW()-$A$10,Alpha_Boat_Rank,0))),\"\")","v":3},{"$f":"IF(AND(ROW()-$A$10<=Number_of_Contestants,COLUMN()-3<=Number_of_CPs),ABS(INDEX(CP3_Error,,MATCH(ROW()-$A$10,Alpha_Boat_Rank,0))),\"\")","v":5},{"$f":"IF(AND(ROW()-$A$10<=Number_of_Contestants,COLUMN()-3<=Number_of_CPs),ABS(INDEX(CP4_Error,,MATCH(ROW()-$A$10,Alpha_Boat_Rank,0))),\"\")","v":8},{"$f":"IF(AND(ROW()-$A$10<=Number_of_Contestants,COLUMN()-3<=Number_of_CPs),ABS(INDEX(CP5_Error,,MATCH(ROW()-$A$10,Alpha_Boat_Rank,0))),\"\")","v":""},{"$f":"IF(AND(ROW()-$A$10<=Number_of_Contestants,COLUMN()-3<=Number_of_CPs),ABS(INDEX(CP6_Error,,MATCH(ROW()-$A$10,Alpha_Boat_Rank,0))),\"\")","v":""},{"$f":"IF(AND(ROW()-$A$10<=Number_of_Contestants,COLUMN()-3<=Number_of_CPs),ABS(INDEX(CP7_Error,,MATCH(ROW()-$A$10,Alpha_Boat_Rank,0))),\"\")","v":""},{"$f":"IF(AND(ROW()-$A$10<=Number_of_Contestants,COLUMN()-3<=Number_of_CPs),ABS(INDEX(CP8_Error,,MATCH(ROW()-$A$10,Alpha_Boat_Rank,0))),\"\")","v":""}]
["KLETTITAT","QCYC","Team Klett/Elbon/Cullen",43,29,6,2,"","","",""]
["MISS MIRANDA","SYC","Larry O'Keefe",15,1,43,3,"","","",""]
["PANACHE","SYC","Brent Reys",50,17,11,17,"","","",""]
["PEACHY KEEN","BYC","Mike Henry",23,1,17,3,"","","",""]
["RAZZLE","SYC","Ken Case",38,122,38,12,"","","",""]
["SAGA","BYC","Dan DeGard",17,61,5,36,"","","",""]
["SARAH B","BYC","Jim VanAntwerp",0,11,20,10,"","","",""]
["SOJOURN","MBYC","Clint Chapin",21,59,30,11,"","","",""]
["","","","","","","","","","",""]
["","","","","","","","","","",""]
["","","","","","","","","","",""]
["","","","","","","","","","",""]
["","","","","","","","","","",""]
["","","","","","","","","","",""]
["","","","","","","","","","",""]
["","","","","","","","","","",""]
["","","","","","","","","","",""]
["","","","","","","","","","",""]
["","","","","","","","","","",""]
["","","","","","","","","","",""]
["","","","","","","","","","",""]
["","","","","","","","","","",""]
["","","","","","","","","","",""]
["","","","","","","","","","",""]
["","","","","","","","","","",""]
["","","","","","","","","","",""]
["","","","","","","","","","",""]
["","","","","","","","","","",""]
["","","","","","","","","","",""]
["","","","","","","","","","",""]
["","","","","","","","","","",""]
[{"$f":"IF(ROW()-$A$10<=Number_of_Contestants,UPPER(INDEX(Boat_Names,,MATCH(ROW()-$A$10,Alpha_Boat_Rank,0))),\"\")","v":""},{"$f":"IF(ROW()-$A$10<=Number_of_Contestants,INDEX(Club_Names,,MATCH(ROW()-$A$10,Alpha_Boat_Rank,0)),\"\")","v":""},{"$f":"IF(ROW()-$A$10<=Number_of_Contestants,INDEX(Contestant_Names,,MATCH(ROW()-$A$10,Alpha_Boat_Rank,0)),\"\")","v":""},{"$f":"IF(AND(ROW()-$A$10<=Number_of_Contestants,COLUMN()-3<=Number_of_CPs),ABS(INDEX(CP1_Error,,MATCH(ROW()-$A$10,Alpha_Boat_Rank,0))),\"\")","v":""},{"$f":"IF(AND(ROW()-$A$10<=Number_of_Contestants,COLUMN()-3<=Number_of_CPs),ABS(INDEX(CP2_Error,,MATCH(ROW()-$A$10,Alpha_Boat_Rank,0))),\"\")","v":""},{"$f":"IF(AND(ROW()-$A$10<=Number_of_Contestants,COLUMN()-3<=Number_of_CPs),ABS(INDEX(CP3_Error,,MATCH(ROW()-$A$10,Alpha_Boat_Rank,0))),\"\")","v":""},{"$f":"IF(AND(ROW()-$A$10<=Number_of_Contestants,COLUMN()-3<=Number_of_CPs),ABS(INDEX(CP4_Error,,MATCH(ROW()-$A$10,Alpha_Boat_Rank,0))),\"\")","v":""},{"$f":"IF(AND(ROW()-$A$10<=Number_of_Contestants,COLUMN()-3<=Number_of_CPs),ABS(INDEX(CP5_Error,,MATCH(ROW()-$A$10,Alpha_Boat_Rank,0))),\"\")","v":""},{"$f":"IF(AND(ROW()-$A$10<=Number_of_Contestants,COLUMN()-3<=Number_of_CPs),ABS(INDEX(CP6_Error,,MATCH(ROW()-$A$10,Alpha_Boat_Rank,0))),\"\")","v":""},{"$f":"IF(AND(ROW()-$A$10<=Number_of_Contestants,COLUMN()-3<=Number_of_CPs),ABS(INDEX(CP7_Error,,MATCH(ROW()-$A$10,Alpha_Boat_Rank,0))),\"\")","v":""},{"$f":"IF(AND(ROW()-$A$10<=Number_of_Contestants,COLUMN()-3<=Number_of_CPs),ABS(INDEX(CP8_Error,,MATCH(ROW()-$A$10,Alpha_Boat_Rank,0))),\"\")","v":""}]
["","","","","","","","","","",""]
["","","","","","","","","","",""]
["","","","","","","","","","",""]
["","","","","","","","","","",""]
["","","","","","","","","","",""]
["","","","","","","","","","",""]
["","","","","","","","","","",""]
["","","","","","","","","","",""]
["","","","","","","","","","",""]
["","","","","","","","","","",""]
["","","","","","","","","","",""]
["","","","","","","","","","",""]
["","","","","","","","","","",""]
["","","","","","","","","","",""]
["","","","","","","","","","",""]
["","","","","","","","","","",""]
["","","","","","","","","","",""]
["","","","","","","","","","",""]
["","","","","","","","","","",""]
["","","","","","","","","","",""]
["","","","","","","","","","",""]
["","","","","","","","","","",""]
["","","","","","","","","","",""]
["","","","","","","","","","",""]
["","","","","","","","","","",""]
["","","","","","","","","","",""]
["","","","","","","","","","",""]
[{"$f":"IF(ROW()-8<=Number_of_Contestants,UPPER(INDEX('Log Entry'!$C$4:$BJ$4,,MATCH(ROW()-8,'Log Entry'!$C$83:$BJ$83,0))),\"\")","v":""},{"$f":"IF(ROW()-8<=Number_of_Contestants,INDEX('Log Entry'!$C$5:$BJ$5,,MATCH(ROW()-8,'Log Entry'!$C$83:$BJ$83,0)),\"\")","v":""},{"$f":"IF(ROW()-8<=Number_of_Contestants,INDEX('Log Entry'!$C$2:$BJ$2,,MATCH(ROW()-8,'Log Entry'!$C$83:$BJ$83,0)),\"\")","v":""},{"$f":"IF(ROW()-8<=Number_of_Contestants,ABS(INDEX('Log Entry'!$C$61:$BJ$61,,MATCH(ROW()-8,'Log Entry'!$C$83:$BJ$83,0))),\"\")","v":""},{"$f":"IF(ROW()-8<=Number_of_Contestants,ABS(INDEX('Log Entry'!$C$62:$BJ$62,,MATCH(ROW()-8,'Log Entry'!$C$83:$BJ$83,0))),\"\")","v":""},{"$f":"IF(ROW()-8<=Number_of_Contestants,ABS(INDEX('Log Entry'!$C$63:$BJ$63,,MATCH(ROW()-8,'Log Entry'!$C$83:$BJ$83,0))),\"\")","v":""},{"$f":"IF(ROW()-8<=Number_of_Contestants,ABS(INDEX('Log Entry'!$C$64:$BJ$64,,MATCH(ROW()-8,'Log Entry'!$C$83:$BJ$83,0))),\"\")","v":""},{"$f":"IF(ROW()-8<=Number_of_Contestants,ABS(INDEX('Log Entry'!$C$65:$BJ$65,,MATCH(ROW()-8,'Log Entry'!$C$83:$BJ$83,0))),\"\")","v":""},{"$f":"IF(ROW()-8<=Number_of_Contestants,ABS(INDEX('Log Entry'!$C$66:$BJ$66,,MATCH(ROW()-8,'Log Entry'!$C$83:$BJ$83,0))),\"\")","v":""},{"$f":"IF(ROW()-8<=Number_of_Contestants,ABS(INDEX('Log Entry'!$C$67:$BJ$67,,MATCH(ROW()-8,'Log Entry'!$C$83:$BJ$83,0))),\"\")","v":""},{"$f":"IF(ROW()-8<=Number_of_Contestants,ABS(INDEX('Log Entry'!$C$68:$BJ$68,,MATCH(ROW()-8,'Log Entry'!$C$83:$BJ$83,0))),\"\")","v":""}]
[{"$f":"IF(ROW()-8<=Number_of_Contestants,UPPER(INDEX('Log Entry'!$C$4:$BJ$4,,MATCH(ROW()-8,'Log Entry'!$C$83:$BJ$83,0))),\"\")","v":""},{"$f":"IF(ROW()-8<=Number_of_Contestants,INDEX('Log Entry'!$C$5:$BJ$5,,MATCH(ROW()-8,'Log Entry'!$C$83:$BJ$83,0)),\"\")","v":""},{"$f":"IF(ROW()-8<=Number_of_Contestants,INDEX('Log Entry'!$C$2:$BJ$2,,MATCH(ROW()-8,'Log Entry'!$C$83:$BJ$83,0)),\"\")","v":""},{"$f":"IF(ROW()-8<=Number_of_Contestants,ABS(INDEX('Log Entry'!$C$61:$BJ$61,,MATCH(ROW()-8,'Log Entry'!$C$83:$BJ$83,0))),\"\")","v":""},{"$f":"IF(ROW()-8<=Number_of_Contestants,ABS(INDEX('Log Entry'!$C$62:$BJ$62,,MATCH(ROW()-8,'Log Entry'!$C$83:$BJ$83,0))),\"\")","v":""},{"$f":"IF(ROW()-8<=Number_of_Contestants,ABS(INDEX('Log Entry'!$C$63:$BJ$63,,MATCH(ROW()-8,'Log Entry'!$C$83:$BJ$83,0))),\"\")","v":""},{"$f":"IF(ROW()-8<=Number_of_Contestants,ABS(INDEX('Log Entry'!$C$64:$BJ$64,,MATCH(ROW()-8,'Log Entry'!$C$83:$BJ$83,0))),\"\")","v":""},{"$f":"IF(ROW()-8<=Number_of_Contestants,ABS(INDEX('Log Entry'!$C$65:$BJ$65,,MATCH(ROW()-8,'Log Entry'!$C$83:$BJ$83,0))),\"\")","v":""},{"$f":"IF(ROW()-8<=Number_of_Contestants,ABS(INDEX('Log Entry'!$C$66:$BJ$66,,MATCH(ROW()-8,'Log Entry'!$C$83:$BJ$83,0))),\"\")","v":""},{"$f":"IF(ROW()-8<=Number_of_Contestants,ABS(INDEX('Log Entry'!$C$67:$BJ$67,,MATCH(ROW()-8,'Log Entry'!$C$83:$BJ$83,0))),\"\")","v":""},{"$f":"IF(ROW()-8<=Number_of_Contestants,ABS(INDEX('Log Entry'!$C$68:$BJ$68,,MATCH(ROW()-8,'Log Entry'!$C$83:$BJ$83,0))),\"\")","v":""}]

{"sheet":"Cross-Check Log","index":11,"n_rows":42,"n_cols":30,"rows_kept":42,"cut":false,"hidden":false,"merged":[[41,1,41,4],[41,5,41,26],[68,2,68,20],[68,21,68,26],[26,2,26,4],[36,1,36,19],[36,20,36,26],[37,1,37,19],[37,20,37,26],[39,1,39,19],[39,20,39,26],[32,1,32,26],[33,1,33,26],[34,1,34,19],[34,20,34,26],[35,1,35,19],[35,20,35,26],[29,1,29,19],[29,20,29,26],[30,1,30,19],[30,20,30,26],[31,1,31,19],[31,20,31,26],[28,1,28,26],[40,1,40,26],[24,2,24,4],[24,5,25,5],[24,6,24,14],[24,15,24,18],[24,19,25,19],[26,6,26,18],[26,20,26,22],[26,24,26,26],[27,1,27,26],[38,1,38,19],[38,20,38,26],[23,2,23,4],[23,6,23,11],[23,13,23,18],[23,20,23,23],[23,24,23,25],[24,20,24,23],[24,24,24,25],[25,2,25,4],[25,6,25,14],[25,15,25,18],[25,20,25,22],[25,24,25,26],[21,2,21,4],[21,6,21,11],[21,13,21,18],[21,20,21,23],[21,24,21,25],[22,2,22,4],[22,6,22,11],[22,13,22,18],[22,20,22,23],[22,24,22,25],[19,2,19,4],[19,6,19,11],[19,13,19,18],[19,20,19,23],[19,24,19,25],[20,2,20,4],[20,6,20,11],[20,13,20,18],[20,20,20,23],[20,24,20,25],[17,2,17,4],[17,6,17,11],[17,13,17,18],[17,20,17,23],[17,24,17,25],[18,2,18,4],[18,6,18,11],[18,13,18,18],[18,20,18,23],[18,24,18,25],[15,2,15,4],[15,6,15,11],[15,13,15,18],[15,20,15,23],[15,24,15,25],[16,2,16,4],[16,6,16,11],[16,13,16,18],[16,20,16,23],[16,24,16,25],[2,1,2,26],[3,1,4,26],[5,1,5,26],[6,1,6,2],[6,3,6,12],[6,13,6,16],[6,17,6,26],[7,1,7,2],[7,3,7,12],[7,13,7,16],[7,17,7,26],[8,1,8,26],[9,1,9,4],[9,6,9,11],[9,13,9,18],[9,20,9,26],[10,1,10,4],[10,6,10,11],[10,13,13,18],[10,20,10,23],[10,24,14,26],[11,1,11,4],[11,6,11,11],[11,20,11,23],[12,1,12,4],[12,6,12,11],[12,21,12,23],[13,1,13,4],[13,6,13,11],[13,21,13,23],[14,1,15,1],[14,2,14,4],[14,6,14,11],[14,13,14,18],[14,20,14,23]]}
[170]
[{"$f":"MATCH(A1,'Log Entry'!C1:BJ1,0)","v":{"$error":"#N/A"}}]
[null,"CROSS-CHECK LOG"]
[null,"This Log is used to verify that the Official Race Scorer has correctly entered the data from the Contestant's Log.  \nPlease cross-check it against your Log to make sure there are no discrepancies."]
[]
[]
[null,"CONTEST NAME:",null,{"$f":"Contest_Name","v":"Stimson"},null,null,null,null,null,null,null,null,null,"DATE:",null,null,null,{"$f":"Contest_Date","v":"2018-09-15"},null,null,null,null,null,null,null,null,null,null," "]
[null,"CONTESTANT:",null,{"$f":"INDEX(Contestant_Names,,$A$2)","v":{"$error":"#N/A"}},null,null,null,null,null,null,null,null,null,"BOAT NAME:",null,null,null,{"$f":"INDEX(Boat_Names,,$A$2)","v":{"$error":"#N/A"}}]
[]
[null,"from CONTESTANT PREDICTED LOG",null,null,null,null,"from CONTEST LOG",null,null,null,null,null,null,"TIME OUT(S)",null,null,null,null,null,null,"ACTUAL RESULTS"]
[null,"Predicted Start",null,null,null,null,"Actual Start",null,null,null,null,null,null,"            TIME OUT(S)              \"IF NEEDED\"",null,null,null,null,null,null,"Difference From",null,null,null,"SECONDS OF ERROR"]
[null,"Time of Day",null,null,null,null,"Time of Day",null,null,null,null,null,null,null,null,null,null,null,null,null,"Predicted start"]
[null,"Hr : Min : Sec",null,null,null,null,"Hr : Min : Sec",null,null,null,null,null,null,null,null,null,null,null,null,null,"Max","Min : Sec"]
[null,{"$f":"INDEX(Predicted_Start_Times,,$A$2)","v":{"$error":"#N/A"}},null,null,null,null,{"$f":"INDEX(Actual_Start_Times,,$A$2)","v":{"$error":"#N/A"}},null,null,null,null,null,null,null,null,null,null,null,null,null,"5 min",{"$f":"INDEX(Start_Difference_Times,,$A$2)","v":{"$error":"#N/A"}}]
[null,"CP#","PREDICTED RUN TIME",null,null,null,"Actual TIME OF DAY",null,null,null,null,null,null,"Actual T.O. RUN TIMES",null,null,null,null,null,null,"Actual Run time"]
[null,null,"Hr : Min : Sec",null,null,null,"Hr : Min : Sec",null,null,null,null,null,null,"Hr : Min : Sec",null,null,null,null,null,null,"Hr : Min : Sec",null,null,null,"Fast",null,"Slow"]
[null,1,{"$f":"INDEX(CP1_Predicted_Run_Times,,$A$2)","v":{"$error":"#N/A"}},null,null,null,{"$f":"INDEX(CP1_Actual_Times,,$A$2)","v":{"$error":"#N/A"}},null,null,null,null,null,null,{"$f":"INDEX(CP1_Time_Outs,,$A$2)","v":{"$error":"#N/A"}},null,null,null,null,null,null,{"$f":"INDEX(CP1_Actual_Run_Times,,$A$2)","v":{"$error":"#N/A"}},null,null,null,{"$f":"IF(AB17<0,0,AB17)","v":{"$error":"#N/A"}},null,{"$f":"IF(AB17<0,AB17*-1,IF(AND(AB17=0,C17<>0),0.000001,0))","v":{"$error":"#N/A"}},{"$f":"INDEX(CP1_Error,,$A$2)","v":{"$error":"#N/A"}}]
[null,2,{"$f":"INDEX(CP2_Predicted_Run_Times,,$A$2)","v":{"$error":"#N/A"}},null,null,null,{"$f":"INDEX(CP2_Actual_Times,,$A$2)","v":{"$error":"#N/A"}},null,null,null,null,null,null,{"$f":"INDEX(CP2_Time_Outs,,$A$2)","v":{"$error":"#N/A"}},null,null,null,null,null,null,{"$f":"INDEX(CP2_Actual_Run_Times,,$A$2)","v":{"$error":"#N/A"}},null,null,null,{"$f":"IF(AB18<0,0,AB18)","v":{"$error":"#N/A"}},null,{"$f":"IF(AB18<0,AB18*-1,IF(AND(AB18=0,C18<>0),0.000001,0))","v":{"$error":"#N/A"}},{"$f":"INDEX(CP2_Error,,$A$2)","v":{"$error":"#N/A"}}]
[null,3,{"$f":"INDEX(CP3_Predicted_Run_Times,,$A$2)","v":{"$error":"#N/A"}},null,null,null,{"$f":"INDEX(CP3_Actual_Times,,$A$2)","v":{"$error":"#N/A"}},null,null,null,null,null,null,{"$f":"INDEX(CP3_Time_Outs,,$A$2)","v":{"$error":"#N/A"}},null,null,null,null,null,null,{"$f":"INDEX(CP3_Actual_Run_Times,,$A$2)","v":{"$error":"#N/A"}},null,null,null,{"$error":"#N/A"},null,{"$error":"#N/A"},{"$f":"INDEX(CP3_Error,,$A$2)","v":{"$error":"#N/A"}}]
[null,4,{"$f":"INDEX(CP4_Predicted_Run_Times,,$A$2)","v":{"$error":"#N/A"}},null,null,null,{"$f":"INDEX(CP4_Actual_Times,,$A$2)","v":{"$error":"#N/A"}},null,null,null,null,null,null,{"$f":"INDEX(CP4_Time_Outs,,$A$2)","v":{"$error":"#N/A"}},null,null,null,null,null,null,{"$f":"INDEX(CP4_Actual_Run_Times,,$A$2)","v":{"$error":"#N/A"}},null,null,null,{"$error":"#N/A"},null,{"$error":"#N/A"},{"$f":"INDEX(CP4_Error,,$A$2)","v":{"$error":"#N/A"}}]
[null,5,{"$f":"INDEX(CP5_Predicted_Run_Times,,$A$2)","v":{"$error":"#N/A"}},null,null,null,{"$f":"INDEX(CP5_Actual_Times,,$A$2)","v":{"$error":"#N/A"}},null,null,null,null,null,null,{"$f":"INDEX(CP5_Time_Outs,,$A$2)","v":{"$error":"#N/A"}},null,null,null,null,null,null,{"$f":"INDEX(CP5_Actual_Run_Times,,$A$2)","v":{"$error":"#N/A"}},null,null,null,{"$error":"#N/A"},null,{"$error":"#N/A"},{"$f":"INDEX(CP5_Error,,$A$2)","v":{"$error":"#N/A"}}]
[null,6,{"$f":"INDEX(CP6_Predicted_Run_Times,,$A$2)","v":{"$error":"#N/A"}},null,null,null,{"$f":"INDEX(CP6_Actual_Times,,$A$2)","v":{"$error":"#N/A"}},null,null,null,null,null,null,{"$f":"INDEX(CP6_Time_Outs,,$A$2)","v":{"$error":"#N/A"}},null,null,null,null,null,null,{"$f":"INDEX(CP6_Actual_Run_Times,,$A$2)","v":{"$error":"#N/A"}},null,null,null,{"$error":"#N/A"},null,{"$error":"#N/A"},{"$f":"INDEX(CP6_Error,,$A$2)","v":{"$error":"#N/A"}}]
[null,7,{"$f":"INDEX(CP7_Predicted_Run_Times,,$A$2)","v":{"$error":"#N/A"}},null,null,null,{"$f":"INDEX(CP7_Actual_Times,,$A$2)","v":{"$error":"#N/A"}},null,null,null,null,null,null,{"$f":"INDEX(CP7_Time_Outs,,$A$2)","v":{"$error":"#N/A"}},null,null,null,null,null,null,{"$f":"INDEX(CP7_Actual_Run_Times,,$A$2)","v":{"$error":"#N/A"}},null,null,null,{"$error":"#N/A"},null,{"$error":"#N/A"},{"$f":"INDEX(CP7_Error,,$A$2)","v":{"$error":"#N/A"}}]
[null,8,{"$f":"INDEX(CP8_Predicted_Run_Times,,$A$2)","v":{"$error":"#N/A"}},null,null,null,{"$f":"INDEX(CP8_Actual_Times,,$A$2)","v":{"$error":"#N/A"}},null,null,null,null,null,null,{"$f":"INDEX(CP8_Time_Outs,,$A$2)","v":{"$error":"#N/A"}},null,null,null,null,null,null,{"$f":"INDEX(CP8_Actual_Run_Times,,$A$2)","v":{"$error":"#N/A"}},null,null,null,{"$error":"#N/A"},null,{"$error":"#N/A"},{"$f":"INDEX(CP8_Error,,$A$2)","v":{"$error":"#N/A"}}]
[null,"TOTALS",{"$f":"INDEX(Total_Predicted_Run_Times,,$A$2)","v":{"$error":"#N/A"}},null,null,null,"Actual Total Run Time (Hr:Min:Sec)",null,null,null,null,null,null,null,null,{"$f":"INDEX(Actual_Total_Run_Times,,$A$2)","v":{"$error":"#N/A"}},null,null,null,null,"ACTUAL TOTAL BY FAST & SLOW (seconds)",null,null,null,{"$f":"IF(P26=0,\"\",SUM(Y17:Z24))","v":{"$error":"#N/A"}},null,{"$f":"IF(P26=0,\"\",SUM(AA17:AA24))","v":{"$error":"#N/A"}}]
[null,"TOTAL SEC",{"$f":"INDEX(Total_Predicted_Seconds,,$A$2)","v":{"$error":"#N/A"}},null,null,null,"Actual Total Run Time (seconds)",null,null,null,null,null,null,null,null,{"$f":"INDEX(Total_Actual_Seconds,,$A$2)","v":{"$error":"#N/A"}},null,null,null,null,null,null,null,null,null,null,null,null,null," "]
[null,"FINISH",{"$f":"INDEX(Finish_Times,,$A$2)","v":{"$error":"#N/A"}},null,null,null,null,null,null,null,null,null,null,null,null,null,null,null,null,null,"ACTUAL TOTAL SECONDS OF ERROR",null,null,null,{"$f":"IF(P26=0,\"\",Y25+AA25)","v":{"$error":"#N/A"}}]
[]
[null,"CALCULATION PROOFS"]
[null,"A) SLOW SECONDS OF ERROR MINUS FAST SECONDS OF ERROR:",null,null,null,null,null,null,null,null,null,null,null,null,null,null,null,null,null,null,{"$f":"IF(OR(C25=0,P25=0),\"\",AA25-Y25)","v":{"$error":"#N/A"}}]
[null,"B)  DIFFERENCE BETWEEN PREDICTED  AND ACTUAL TOTAL SECONDS:",null,null,null,null,null,null,null,null,null,null,null,null,null,null,null,null,null,null,{"$f":"IF(OR(C26=0,P26=0),\"\",P26-C26)","v":{"$error":"#N/A"}},null,null,null,null,null,null,null," "]
[null,"DIFFERENCE BETWEEN ABOVE A AND B  (RESULTS MUST EQUAL ZERO):",null,null,null,null,null,null,null,null,null,null,null,null,null,null,null,null,null,null,{"$f":"IF(OR(C26=0,P26=0),\"\",U30-U31)","v":{"$error":"#N/A"}}]
[]
[null,"NET ERROR CALCULATIONS"]
[null,"OFFICIAL MILEAGE (NM)",null,null,null,null,null,null,null,null,null,null,null,null,null,null,null,null,null,null,{"$f":"Official_Mileage","v":14}]
[null,"PREDICTED SPEED FOR HANDICAP (kn),  (Official mi X 3600 ) / Total Pred sec ",null,null,null,null,null,null,null,null,null,null,null,null,null,null,null,null,null,null,{"$f":"INDEX(Predicted_Speeds,,$A$2)","v":{"$error":"#N/A"}}]
[null,"HANDICAP, Refer to Predicted Log Racing Handbook for Predicted Speed",null,null,null,null,null,null,null,null,null,null,null,null,null,null,null,null,null,null,{"$f":"INDEX(Handicaps,,$A$2)","v":{"$error":"#N/A"}}]
[null,"GROSS ERROR %, (Total Seconds of Error X 100) / total predicted sec (without Handicap for Lake Races)",null,null,null,null,null,null,null,null,null,null,null,null,null,null,null,null,null,null,{"$f":"INDEX(Gross_Errors,,$A$2)","v":{"$error":"#N/A"}}]
[null,"PENALTY ERROR % (If Any)",null,null,null,null,null,null,null,null,null,null,null,null,null,null,null,null,null,null,{"$f":"INDEX(Penalties,,$A$2)","v":{"$error":"#N/A"}}]
[null,"NET ERROR %. Gross Error X Handicap (Salt Water Races)",null,null,null,null,null,null,null,null,null,null,null,null,null,null,null,null,null,null,{"$f":"INDEX(Net_Error,,$A$2)","v":{"$error":"#N/A"}}]
[]
[null,"SIGNED BY CONTESTANT:"]

{"sheet":"Class Certificates","index":12,"n_rows":50,"n_cols":1,"rows_kept":50,"cut":false,"hidden":false,"merged":[]}
[{"$f":"\"Class 1 - 2nd Place \"&YEAR(Contest_Date)","v":"Class 1 - 2nd Place 2018"}]
[]
[{"$f":"LOOKUP('Class Results'!D15,'Yacht Clubs'!A2:B11)","v":{"$error":"#N/A"}}]
[{"$f":"TEXT('Class Results'!E15,\"0.0000%\")&\" Error\"","v":" Error"}]
[{"$f":"'Class Results'!A15&\" - \"&'Class Results'!B15&\"/\"&'Class Results'!C15","v":" - /"}]
[{"$f":"\"Class 1 - 3rd Place \"&YEAR(Contest_Date)","v":"Class 1 - 3rd Place 2018"}]
[]
[{"$f":"LOOKUP('Class Results'!D16,'Yacht Clubs'!A2:B11)","v":{"$error":"#N/A"}}]
[{"$f":"TEXT('Class Results'!E16,\"0.0000%\")&\" Error\"","v":" Error"}]
[{"$f":"'Class Results'!A16&\" - \"&'Class Results'!B16&\"/\"&'Class Results'!C16","v":" - /"}]
[{"$f":"\"Class 2 - 2nd Place \"&YEAR(Contest_Date)","v":"Class 2 - 2nd Place 2018"}]
[]
[{"$f":"LOOKUP('Class Results'!D25,'Yacht Clubs'!A2:B11)","v":{"$error":"#N/A"}}]
[{"$f":"TEXT('Class Results'!E25,\"0.0000%\")&\" Error\"","v":" Error"}]
[{"$f":"'Class Results'!A25&\" - \"&'Class Results'!B25&\"/\"&'Class Results'!C25","v":" - /"}]
[{"$f":"\"Class 2 - 3nd Place \"&YEAR(Contest_Date)","v":"Class 2 - 3nd Place 2018"}]
[]
[{"$f":"LOOKUP('Class Results'!D26,'Yacht Clubs'!A2:B11)","v":{"$error":"#N/A"}}]
[{"$f":"TEXT('Class Results'!E26,\"0.0000%\")&\" Error\"","v":" Error"}]
[{"$f":"'Class Results'!A26&\" - \"&'Class Results'!B26&\"/\"&'Class Results'!C26","v":" - /"}]
[{"$f":"\"Class 3 - 2nd Place \"&YEAR(Contest_Date)","v":"Class 3 - 2nd Place 2018"}]
[]
[{"$f":"LOOKUP('Class Results'!D35,'Yacht Clubs'!A2:B11)","v":{"$error":"#N/A"}}]
[{"$f":"TEXT('Class Results'!E35,\"0.0000%\")&\" Error\"","v":" Error"}]
[{"$f":"'Class Results'!A35&\" - \"&'Class Results'!B35&\"/\"&'Class Results'!C35","v":" - /"}]
[{"$f":"\"Class 3 - 3nd Place \"&YEAR(Contest_Date)","v":"Class 3 - 3nd Place 2018"}]
[]
[{"$f":"LOOKUP('Class Results'!D36,'Yacht Clubs'!A2:B11)","v":{"$error":"#N/A"}}]
[{"$f":"TEXT('Class Results'!E36,\"0.0000%\")&\" Error\"","v":" Error"}]
[{"$f":"'Class Results'!A36&\" - \"&'Class Results'!B36&\"/\"&'Class Results'!C36","v":" - /"}]
[{"$f":"\"Class 4 - 2nd Place \"&YEAR(Contest_Date)","v":"Class 4 - 2nd Place 2018"}]
[]
[{"$f":"LOOKUP('Class Results'!D45,'Yacht Clubs'!A2:B11)","v":{"$error":"#N/A"}}]
[{"$f":"TEXT('Class Results'!E45,\"0.0000%\")&\" Error\"","v":" Error"}]
[{"$f":"'Class Results'!A45&\" - \"&'Class Results'!B45&\"/\"&'Class Results'!C45","v":" - /"}]
[{"$f":"\"Class 4 - 3nd Place \"&YEAR(Contest_Date)","v":"Class 4 - 3nd Place 2018"}]
[]
[{"$f":"LOOKUP('Class Results'!D46,'Yacht Clubs'!A2:B11)","v":{"$error":"#N/A"}}]
[{"$f":"TEXT('Class Results'!E46,\"0.0000%\")&\" Error\"","v":" Error"}]
[{"$f":"'Class Results'!A46&\" - \"&'Class Results'!B46&\"/\"&'Class Results'!C46","v":" - /"}]
[{"$f":"\"Class 5 - 2nd Place \"&YEAR(Contest_Date)","v":"Class 5 - 2nd Place 2018"}]
[]
[{"$f":"LOOKUP('Class Results'!D55,'Yacht Clubs'!A2:B11)","v":"Seattle Yacht Club"}]
[{"$f":"TEXT('Class Results'!E55,\"0.0000%\")&\" Error\"","v":"2.6682% Error"}]
[{"$f":"'Class Results'!A55&\" - \"&'Class Results'!B55&\"/\"&'Class Results'!C55","v":"RAZZLE - Ken Case/Debbie Case"}]
[{"$f":"\"Class 5 - 3nd Place \"&YEAR(Contest_Date)","v":"Class 5 - 3nd Place 2018"}]
[]
[{"$f":"LOOKUP('Class Results'!D56,'Yacht Clubs'!A2:B11)","v":{"$error":"#N/A"}}]
[{"$f":"TEXT('Class Results'!E56,\"0.0000%\")&\" Error\"","v":" Error"}]
[{"$f":"'Class Results'!A56&\" - \"&'Class Results'!B56&\"/\"&'Class Results'!C56","v":" - /"}]

{"sheet":"Yacht Clubs","index":13,"n_rows":11,"n_cols":2,"rows_kept":11,"cut":false,"hidden":false,"merged":[]}
["Yacht Clubs (in alphabetical order)"]
["BYC","Bremerton Yacht Club"]
["GHYC","Gig Harbor Yacht Club"]
["MBYC","Meydenbauer Bay Yacht Club"]
["POYC","Port Orchard Yacht Club"]
["PYC","Poulsbo Yacht Club"]
["QCYC","Queen City Yacht Club"]
["RYC","Rainier Yacht Club"]
["SYC","Seattle Yacht Club"]
["Totem YC","Totem Yacht Club"]
["TYC","Tacoma Yacht Club"]

{"sheet":"Contestants","index":14,"n_rows":161,"n_cols":8,"rows_kept":161,"cut":false,"hidden":false,"merged":[]}
["IPBA #","Contestant","Navigator","Boat Name","Club","Cruise","Slow","Class"]
[624,"Steve Hazlerig","Zach Johnson","Solara","SYC",8.8870000000000005,6.9930000000000003,3]
[600,"Bob Lindal","Mike McGillin","SUZY Q - A","QCYC",10.039999999999999,6.923,5]
[539,"Scott Strandjord","Jim V / Tyler S","Redemption","SYC",9.0730000000000004,6.9930000000000003,4]
[165,"Brent Reys","Alex Lorenz","PANACHE","SYC",9.4740000000000002,6.923,4]
[7,"Jim Korzetz","Dick Timmerman","FREEDOM","PYC",8.39,7,2]
[511,"Fred Cole","Linda Cole","Mouse Trap","POYC",9.5549999999999997,7,5]
[688,"George Gregg","Bob Johnson","Noble","PYC",7.8470000000000004,7,1]
[715,"Eva Bennison","Dick Bennison","Well Done","TYC",9.5079999999999991,7,5]
[689,"Clint Chapin","Lynn Hvalsoe","Sojourn","MBYC",7.3,7,1]
[169,"Dennis Sheehan","Julie Sheehan","Nauti Gal","PYC",7.4820000000000002,7,1]
[366,"Jerry Downer","Shirley Downer","NORWESTER","GHYC",8.3230000000000004,7,2]
[583,"Steve Brett","Deana Brett","Ocean Jewel","BYC",8.26,7,2]
[655,"Jim Korzetz","Dick Timmerman","Freedom","PYC",8.6129999999999995,7,3]
[120,"Mike Henry","Billie Henry","Peachy Keen","BYC",8.1750000000000007,7,2]
[677,"Ken Case","Debbie Case","Razzle","SYC",9.89,7,5]
[672,"Paul Austin","Don Decock","Nifty Fifty","MBYC",8,7,1]
[204,"Dave Padgett","Russ Oberg","Slip Away","QCYC",8.8889999999999993,7,3]
[170,"Todd Prodzinski","Larry O'Keefe","Miss Miranda","SYC",8.8670000000000009,7,3]
[686,"George Babbitt","Louise Babbitt","General Quarters","GHYC",8.61,7,3]
[678,"Bill Anderson","Trish Anderson","The Tillie","QCYC",9.01,7,4]
[640,"Chuck Irwin","Beth Irwin","LAUGHIN' PLACE","TYC",9.5519999999999996,7,5]
[666,"Tom Green","Bruce Cullen","Diastole","MBYC",10.792999999999999,7,5]
[683,"Dan Frank","Gary Dove","Moon Shine","MBYC",8.57,7,3]
[2,"Dave White","Peggy White","LAZY GAL","QCYC",9.1129999999999995]
[3,"Bob Johnson","Pat Johnson","SCHOTTISCHE IV","PYC",8.01]
[5,"Gordon Dickson","Marilyn Dickson","SEA BEAR II","MBYC",15]
[6,"Jeff Sayer","Carol Sayer","WAYWARD SUN","OYC",0]
[8,"Ron Records","Nancy Records","CONTIGO","GHYC",0]
[9,"Jerry Burton","Barbara Burton","SEA CLOUD","GHYC",0]
[10,"Ray Pond","Bruce Wegner","TOMORROW","TYC",0]
[11,"Dick Perkins","Barbara Perkins","VOYAGER","TYC",0]
[12,"John Bare","Jan Bare","KLATAWA","GHYC",0]
[15,"Dave Wilson","Jan Wilson","SKOOKUM","QCYC",9.6890000000000001]
[16,"Tom Brooke","Mike Mueller","GREAT ESCAPE","PYC",8.93]
[16,"Mike Mueller","Steve Lant","PERSEUS","PYC",9.36]
[19,"Bob Johnson","Frenda Brotherton","DRAGONS LAIR","PYC",0]
[20,"Raymond Gorski","Richard Stevenson","GREAT BEAR","BYC",0]
[22,"Richard Johnson","Scott Strandjord","FRIENDLY TOO","SYC",0]
[24,"Cliff Casad","Carole Casad","TAURUS II","MBYC",8.0530000000000008]
[26,"Mike Leedy","Sharon Leedy","SEA TRUST","BYC",9.7449999999999992]
[30,"Robert Morrice","Rob Morrice","RAPPORT","QCYC",0]
[31,"Russ Oberg","Dave Krows","KATHRINE J.","QCYC",0]
[32,"Carl Weiss","Al Reiche","BLUE CRAB","QCYC",0]
[33,"Ron Rolstad","Carolyn Rolstad","BRASS TACKS","QCYC",0]
[35,"Bob Daugherty","Kathy Daugherty","LADYKAT","PYC",0]
[38,"John Burwell","Nina Burwell","GAVIA","BYC",7.2,null,1]
[39,"John Murphey","Ellen Murphey","STURDY GAL","MBYC",9.0679999999999996,null,4]
[39,"John Murphey","Ellen Murphey","MADERA","MBYC",9.1300000000000008]
[40,"John Barker","Joan Barker","SEA CHANGE","TyYC",0]
[42,"Don Floyd","Jerry Kosse","DANCIN BEAR","BYC",0]
[44,"Bob Wheeler","unknown","CAROUSEL","BYC",0]
[45,"Jeff Ewell","Nancy Ewell","RENEGADE","QCYC",0]
[47,"Ross Nooney","Jess","NOONER","QCYC",0]
[48,"Larrie Chmela","Budwiser","FOUR SEAS","QCYC",0]
[49,"Jerry Downer","Shirley Downer","NORWESTER","GHYC",9.9670000000000005]
[52,"Tim DeCook","DeCook, Carolyn","SARATOGA","QCYC",0]
[53,"Sherri Kennamer","Sally Sturart","TARA","BEYC",8.0359999999999996]
[55,"Phil Hardwick","Gordon Roome","HECTOR","QCYC",0]
[56,"Dick Johnson","Bob Doty","SPIRIT","SYC",0]
[60,"John Rosendale","Keith Conrad","MISTIC BLUE","BYC",8.44]
[65,"Randy Trott","Marcia Trott","RICOHET","",0]
[68,"Julian Keith","Chris Julian","CAPIVATE","",0]
[71,"Scott Grimm","Peter Grimm","GEE GEE","QCYC",0]
[72,"Bob Mihailov","Pat O'Connor","INSIDE PASSAGE","",0]
[76,"Steve Stearns","Marcel Poliquin","SEA LORY","",0]
[78,"Dale Armstrong","Bud Lilly","STOLEN MOMENTS","BYC",9.57]
[79,"Dave Brooks","Doug Breckel","ANDIAMO","",0]
[81,"Dave Miller","Scott Miller","SEA NYMPH II","BYC",7.9,null,1]
[84,"Dave Bucy","Dave Bucy","BIDARKA III","MBYC",9.6]
[100,"Dean Lentgis","Larry Chmela","KALOS FILOS","QCYC",9.27,null,4]
[103,"Owen Ritter","Linda Ritter","OUTBOUND","BYC",7,null,1]
[170,"Bill Grady","Todd Prodzinski","ZORRO","SYC",8.8450000000000006]
[186,"Jim Killingsworth","Dan Schwartz/B.J. Killingsworth","DAISY","SYC",7.4660000000000002]
[203,"Don Larson","Chris Larson","TEWASI","POYC",7.62,null,1]
[216,"Bob Yates","Al Richie","RHUMB LINE","QCYC",9.3089999999999993]
[224,"Bruce Cullen","Miriam Cullen","CAROLINE","MBYC",8.4770000000000003,null,2]
[224,"Bruce Cullen","Vince Firlotte","FANTOME","QCYC",10.169]
[229,"Schell Harmon","Av Harmon","HALF SCHELL","MBYC",8.82]
[372,"Jim Anderson","Linda Anderson","FIDALGO","GHYC",7.476,null,1]
[391,"John Carrosino","Glynis Carrosino","RENDEZVOUS","MBYC",8.0540000000000003]
[433,"John Rogers","Shirley Rogers","NIRVANA","QCYC",8.3000000000000007,null,2]
[464,"Richard Kay","Richard Kay","MATANA","QCYC",7.8]
[469,"Bill Rumbold","Lynne Rumbold","SUNDANCE 2","BYC",8.3040000000000003]
[479,"Jeff Swan","Claire Swan","CLAIRE MARIE","POYC",9.9860000000000007,null,5]
[502,"Lynn Montgomery","Larry Chmela","LIKELY LADY","QCYC",10.404]
[511,"Fred Cole","Dean Anderson","DREAM TOO","POYC",8.3859999999999992]
[517,"Bob Yates","Al Reiche","SEA DAWN","QCYC",9.2390000000000008]
[526,"David Garland","Shannon Underwood","LUCKY DOG","MBYC",9.4700000000000006]
[531,"Rob Rothe","Ross Murry","STARLIGHT EXPRESS","SYC",9.8629999999999995]
[533,"Team Klett/Elbon/Cullen","Elbon/Klett","KLETTITAT","QCYC",9.61,null,5]
[533,"Team Klett/Elbon","Team Klett/Elbon","PUKA KAI","QCYC",8.9480000000000004]
[544,"Russ Oberg","Sharon Benyon","NORDIC LADY","QCYC",8.52]
[549,"Jim Vaupell","SYC","Panahce6","SYC",9.5,null,3]
[554,"Dick Spence","Jan Spence","KICHIGAI","QCYC",8.44]
[584,"Greg Abell","Connie Abell","SEABELL","MBYC",9]
[588,"Patrick Baker","Phil Tenning","CHOPPERS","QCYC",8.8450000000000006,null,3]
[588,"Terry Baker","Carl Tenning","CHOPPERS II","QCYC",8.56]
[630,"Bill Baxter","Brad Graf","MY LIZZY TOO","SYC",11.215]
[632,"Glenn Ryan","Craig Kenyon","AMNESIA","MBYC",9.23,null,4]
[634,"Andy Gerde","Carol Soffel","WINDY I","QCYC",7.75]
[636,"Terynia Smith","Bud Smith","PATTY WAGON","MBYC",9.5489999999999995,null,5]
[636,"Vern Smith","Terynia Smith","PATTYWAGON","MBYC",9.5489999999999995]
[638,"Loretta Pieretti","Bill Sevarge","SISSY DOLL","MBYC",6.95,null,1]
[671,"Dick Bennison","Eva Bennison","WELL DONE","TYC",9.5079999999999991,null,5]
[681,"Chuck Silvernail","Molly Ells","SOLMAR","BYC",7.7930000000000001,null,1]
[687,"Arnie Gaillard","Shultz/Vaupell","BYE Y'ALL","SYC",10.1]
[901,"Phil Osterli","Linda Osterli","Nordic Spirit","PYC",8.3119999999999994,null,2]
[902,"Dick Hall",null,"Wine Down","POYC"]
[903,"Ray Mazza","Brent Parks","Current Affair","POYC",9.3469999999999995,null,4]
[904,"George Bagley","Ryan Bales","Delta Dancer","SYC"]
[608,"Bill Herman","Bill Halley","Summer Hours","MBYC",8.73,null,3]
[363,"Jim Veres","Paul Haack","Vagabond","MBYC",10.199999999999999,null,1]
[905,"Jim Mitchell","Lisa Mitchell","Penalty Box","MBYC",7.25,null,1]
[647,"Dave Sokoloski","Cameron Sokoloski","Sunbear II","MBYC",6.6310000000000002,null,1]
[999,"Tim Subert","Sandy Subert","BEACHMUSIC","RYC",8,null,1]
[998,"Val Watson","Bob Watson","PHANTOM","Totem YC",8.1999999999999993,null,2]
[997,"Barry Rutten","Tom Larkin","SALTY","QCYC",7.4770000000000003,null,1]
[996,"Jim Mitchell","Lisa Mitchell","PENALTY BOX","MBYC",7.25,null,1]
[995,"Bill Herman","Mike Olsson","SUMMER HOURS","MBYC"]
[860,"Dave Cordodor","Jan","QUICK CHARGE","BYC",8.51,null,3]
[990]
[925,"Mike","Jo","OLD MAN IV","USN",8.6,null,3]
[926,"Tom Dion","Kelli","JOINT VENTURE","DIYC",7,null,1]
[646,"Tom Huddleston","Dionne","WHISTLER","BYC",7,null,1]
[694,"Jim VanAntwerp","OJ Potter","SARAH B","BYC",7,null,1]
[527,"Leo Longenecker","Stacy","REALITY CHECK","BYC",8.375,null,2]
[927,"Ryan Lunceford","Steve McNally","PICKLE","BYC",8.1,null,2]
[560,"Rob Bruins","Steve Franklin","OCEAN PEARL","BYC",9.6370000000000005,null,5]
[617,"Charles Billings","Mike Conger","NOBSKA","BYC",7,null,1]
[540,"John Rosendale","Keith Conrad","MISTIC ISLE","BYC",7.3550000000000004,null,1]
[662,"Bob Lewis","Paula Lewis","LIBERTY","BYC",7,null,1]
[294,"Ray Norton","Crystal Norton","IMPRESSIONS","BYC",10.96,null,5]
[458,"John Burwell","Kurt Nelson","GAVIA","BYC",7.2779999999999996,null,1]
[609,"Gene Paxton","Martha Paxton","EVENTIDE","BYC",7,null,1]
[8101,"Scott Miller","Dave Miller","SEA NYMPH II","BYC",7.9]
[668,"Ryan Lunceford","Steve McNally","PICKLE","BYC",7.6,null,1]
[292,"Tom Ripley",null,"BELIEVE IT OR NOT","SYC"]
[579,"Val Watson","Bob Watson","PHANTOM","Totem YC",8.1999999999999993,null,2]
[890]
[704,"Tim Subert","Sandy Subert","BEACH MUSIC","RYC",8.5,null,2]
[614,"John Adair","Dan Robinson","PACIFIC STAR","BYC",8.25,null,2]
[705,"Tom Ripley","Keith Bystrom","BELIEVE IT OR NOT","SYC",7.52,null,1]
[706,"Willard Thomas","Diane Thomas","SEA LIFE","TYC",9.5519999999999996,null,5]
[86,"Chris Williamson","Willow Williamson","KNOT BEHAVIN","TYC",9.4,null,4]
[664,"Tom Dion","Kelli Dion","JOINT VENTURE","DIYC",7.75]
[707,"Seth McNeil","Ben Haak","YANKEE CLIPPER","Sea Scouts",7,null,1]
[663,"Larry O'Keefe","Ted Burns","MISS MIRANDA","SYC",8.5920000000000005,null,3]
[605,null,null,null,null,8.0299999999999994,null,2]
[675,null,null,null,null,8.1999999999999993,null,2]
[166,"Brent Reys"]
[167,"Bob Munn","SYC","Panache2","SYC",9.5,null,3]
[168,"Zach Johnson","SYC","Panache3","SYC",9.5,null,3]
[171,"Bill Grady","SYC","ZORRO2","SYC",8.7850000000000001,null,3]
[172,"Roni Grady","SYC","ZORRO3","SYC",8.7850000000000001,null,3]
[173,"Sara Prodzinski","SYC","ZORRO4","SYC",8.7850000000000001,null,3]
[174]
[1100,"Dan DeGard","JJ Johnson","SAGA","BYC",8,null,1]
[370,"Steve Orr","Shannon Orr","STELLA MARIS","BYC",8.1,null,2]
[589,"Mark Sparks","Elijah Sparks","GOOD TIDINGS","PYC",8.5299999999999994,null,3]
[1200,"Mike McGillin","Bob Lindal","SUZY Q - B","QCYC",10.039999999999999,null,5]